{"text_format":"1","workbook":"xlsx","n_sheets":4,"sheets":["Instructions","Application","Appendix A","Appendix B"],"not_rendered":{"charts":0,"images":1,"macros":0,"external_links":2,"defined_names":14,"comments":0,"pivot_tables":0},"unopened":[],"bounds":{"document_bytes":16777216,"sheet_cells":100000,"rows_first":2000,"rows_last":500,"rows_between":2000,"halvings":0,"cell_chars":16384,"cell_head_chars":4096},"cells_cut":0,"cells_raw":0,"read":"whole","date_system":"1900"}

{"sheet":"Instructions","index":0,"n_rows":32,"n_cols":14,"rows_kept":32,"cut":false,"hidden":false,"merged":[[7,1,7,37],[8,1,8,37],[9,1,9,37],[10,1,10,37],[6,0,6,37],[5,0,5,37],[0,0,0,12],[0,13,0,37],[1,0,1,37],[2,0,2,37],[3,0,3,37],[4,0,4,37],[23,0,23,37],[12,0,12,37],[13,0,13,37],[14,0,14,37],[15,0,15,37],[16,0,16,37],[17,0,17,37],[18,0,18,37],[19,0,19,37],[21,0,21,37],[22,0,22,37],[20,0,20,37],[31,1,31,29],[32,1,32,33],[24,0,24,33],[25,0,25,37],[26,1,26,33],[27,0,27,33],[28,0,28,37],[30,0,30,37]]}
[null,null,null,null,null,null,null,null,null,null,null,null,null,"Integration of Information Technologies (IT) \nin SMBs"]
["Instructions – Application for a Contract Certificate"]
["This document indicates the procedure to follow to obtain the necessary contract certificate to claim the tax credit for the integration of IT in SMBs (CTIM). To apply for a contract certificate, the corporation must complete the prescribed form, which is available on Investissement Québec’s website. \n\nThe application for a certificate must be submitted before the contract is signed. However, Investissement Québec may agree, for reasons it considers reasonable under the circumstances, that a corporation or partnership may submit an application for a contract certificate after the contract has been signed. \n\nThe corporation must then claim this tax credit from Revenu Québec by submitting its income tax return (form CO-17) and the appendix (form CO-1029.8.36.TI) by the prescribed deadline."]
["We strongly encourage you to consult the detailed fact sheet available on our website before completing this form. Be sure to use the most up-to-date version of the form."]
[]
["Only complete applications will be processed. "]
["A complete application* includes:"]
[" -","Duly completed and signed application for contract certificate;"]
{"$rows_left_out":25}
{"sheet":"Application","index":1,"n_rows":112,"n_cols":37,"rows_kept":112,"cut":false,"hidden":false,"merged":[[43,0,43,25],[39,0,39,33],[30,0,30,33],[31,0,31,33],[27,0,27,28],[28,0,28,28],[29,0,29,28],[33,0,33,33],[34,0,34,25],[38,27,38,33],[41,0,41,25],[32,26,32,33],[36,0,36,33],[37,27,37,33],[40,0,40,33],[35,27,35,33],[37,0,37,25],[35,0,35,25],[38,0,38,25],[32,0,32,25],[34,27,34,32],[41,26,41,33],[35,34,35,37],[49,0,49,37],[58,1,58,8],[58,13,58,37],[60,1,60,10],[62,1,62,6],[64,0,64,3],[64,4,64,37],[65,4,65,37],[57,0,57,33],[59,0,59,33],[61,0,61,33],[63,0,63,33],[42,0,42,33],[46,0,46,25],[45,0,45,33],[46,27,46,33],[55,0,55,33],[56,1,56,7],[56,9,56,12],[44,34,44,37],[44,27,44,33],[43,27,43,32],[44,0,44,25],[89,1,89,34],[92,1,92,34],[93,1,93,34],[106,1,106,33],[107,0,107,33],[108,1,108,33],[109,0,109,33],[67,0,67,37],[68,0,68,37],[105,0,105,37],[84,0,84,37],[87,1,87,34],[85,1,85,32],[79,1,79,37],[82,1,82,37],[76,33,76,34],[73,21,73,28],[75,21,75,28],[73,2,73,20],[77,1,77,23],[83,0,83,37],[80,1,80,37],[76,1,76,26],[71,0,71,37],[111,23,111,37],[90,1,90,34],[97,1,97,35],[100,1,100,37],[99,1,99,37],[101,1,101,31],[111,0,111,20],[110,0,110,20],[96,1,96,35],[103,1,103,37],[104,0,104,37],[110,23,110,37],[95,0,97,0],[95,1,95,34],[21,0,21,33],[26,0,26,33],[19,0,19,28],[10,0,10,7],[10,10,10,17],[20,0,20,33],[10,29,10,37],[22,0,22,28],[17,0,17,37],[14,0,14,28],[16,0,16,28],[15,0,15,28],[19,29,19,37],[18,0,18,37],[23,0,23,28],[25,0,25,33],[24,0,24,28],[23,31,23,37],[1,0,1,12],[2,0,2,37],[1,13,1,37],[6,0,6,37],[9,0,9,37],[11,29,11,37],[12,0,12,37],[13,0,13,37],[11,0,11,7],[11,10,11,17],[11,20,11,27],[10,20,10,27],[5,0,5,37],[4,0,4,37],[3,0,3,37],[8,0,8,33],[7,0,7,37],[75,2,75,20],[69,0,69,37],[47,27,47,33],[47,0,47,25],[70,0,70,37],[50,0,50,37],[51,0,51,8],[51,9,51,37],[52,0,52,33],[53,0,53,8],[53,9,53,16],[54,0,54,33],[48,0,48,37]]}
[]
[null,null,null,null,null,null,null,null,null,null,null,null,null,"Integration of Information Technologies (IT) \nin SMBs"]
["Application for a Contract Certificate"]
["Before completing this form, please read the Instructions tab"]
["This tax credit was created for SMBs that carry on mainly activities in the manufacturing, primary, wholesale trade or retail trade sectors. The role of Investissement Québec (IQ) is to ensure compliance with the industry-specific parameters set out in the Act respecting the sectoral parameters of certain fiscal measures, and if warranted, to issue a certificate confirming that the contract is considered to be a qualified IT integration contract.\n\nRevenu Québec has sole responibility for administering the fiscal parameters covered by the Québec Taxation Act. Consequently, it is the corporation's or partnership's responsibility to ensure that it complies with all fiscal parameters and, in particular, that it carries on mainly activities in an eligible sector."]
[]
["1. IDENTIFICATION OF THE CORPORATION OR PARTNERSHIP"]
["(*NOTE: The integration contract (and all invoices, proposals and tenders) must be in the name of the corporation that is claiming the credit, and not that of a management corporation or any other corporation in the group.)"]
{"$rows_left_out":105}
{"sheet":"Appendix A","index":2,"n_rows":30,"n_cols":17,"rows_kept":30,"cut":false,"hidden":false,"merged":[[1982,16,1982,17],[1983,16,1983,17],[1976,16,1976,17],[1977,16,1977,17],[1978,16,1978,17],[1979,16,1979,17],[1980,16,1980,17],[1981,16,1981,17],[1970,16,1970,17],[1971,16,1971,17],[1972,16,1972,17],[1973,16,1973,17],[1974,16,1974,17],[1975,16,1975,17],[1964,16,1964,17],[1965,16,1965,17],[1966,16,1966,17],[1967,16,1967,17],[1968,16,1968,17],[1969,16,1969,17],[1958,16,1958,17],[1959,16,1959,17],[1960,16,1960,17],[1961,16,1961,17],[1962,16,1962,17],[1963,16,1963,17],[1952,16,1952,17],[1953,16,1953,17],[1954,16,1954,17],[1955,16,1955,17],[1956,16,1956,17],[1957,16,1957,17],[1946,16,1946,17],[1947,16,1947,17],[1948,16,1948,17],[1949,16,1949,17],[1950,16,1950,17],[1951,16,1951,17],[1940,16,1940,17],[1941,16,1941,17],[1942,16,1942,17],[1943,16,1943,17],[1944,16,1944,17],[1945,16,1945,17],[1934,16,1934,17],[1935,16,1935,17],[1936,16,1936,17],[1937,16,1937,17],[1938,16,1938,17],[1939,16,1939,17],[1928,16,1928,17],[1929,16,1929,17],[1930,16,1930,17],[1931,16,1931,17],[1932,16,1932,17],[1933,16,1933,17],[1922,16,1922,17],[1923,16,1923,17],[1924,16,1924,17],[1925,16,1925,17],[1926,16,1926,17],[1927,16,1927,17],[1916,16,1916,17],[1917,16,1917,17],[1918,16,1918,17],[1919,16,1919,17],[1920,16,1920,17],[1921,16,1921,17],[1910,16,1910,17],[1911,16,1911,17],[1912,16,1912,17],[1913,16,1913,17],[1914,16,1914,17],[1915,16,1915,17],[1904,16,1904,17],[1905,16,1905,17],[1906,16,1906,17],[1907,16,1907,17],[1908,16,1908,17],[1909,16,1909,17],[1898,16,1898,17],[1899,16,1899,17],[1900,16,1900,17],[1901,16,1901,17],[1902,16,1902,17],[1903,16,1903,17],[1892,16,1892,17],[1893,16,1893,17],[1894,16,1894,17],[1895,16,1895,17],[1896,16,1896,17],[1897,16,1897,17],[1886,16,1886,17],[1887,16,1887,17],[1888,16,1888,17],[1889,16,1889,17],[1890,16,1890,17],[1891,16,1891,17],[1880,16,1880,17],[1881,16,1881,17],[1882,16,1882,17],[1883,16,1883,17],[1884,16,1884,17],[1885,16,1885,17],[1874,16,1874,17],[1875,16,1875,17],[1876,16,1876,17],[1877,16,1877,17],[1878,16,1878,17],[1879,16,1879,17],[1868,16,1868,17],[1869,16,1869,17],[1870,16,1870,17],[1871,16,1871,17],[1872,16,1872,17],[1873,16,1873,17],[1862,16,1862,17],[1863,16,1863,17],[1864,16,1864,17],[1865,16,1865,17],[1866,16,1866,17],[1867,16,1867,17],[1856,16,1856,17],[1857,16,1857,17],[1858,16,1858,17],[1859,16,1859,17],[1860,16,1860,17],[1861,16,1861,17],[1850,16,1850,17],[1851,16,1851,17],[1852,16,1852,17],[1853,16,1853,17],[1854,16,1854,17],[1855,16,1855,17],[1844,16,1844,17],[1845,16,1845,17],[1846,16,1846,17],[1847,16,1847,17],[1848,16,1848,17],[1849,16,1849,17],[1838,16,1838,17],[1839,16,1839,17],[1840,16,1840,17],[1841,16,1841,17],[1842,16,1842,17],[1843,16,1843,17],[1832,16,1832,17],[1833,16,1833,17],[1834,16,1834,17],[1835,16,1835,17],[1836,16,1836,17],[1837,16,1837,17],[1826,16,1826,17],[1827,16,1827,17],[1828,16,1828,17],[1829,16,1829,17],[1830,16,1830,17],[1831,16,1831,17],[1820,16,1820,17],[1821,16,1821,17],[1822,16,1822,17],[1823,16,1823,17],[1824,16,1824,17],[1825,16,1825,17],[1814,16,1814,17],[1815,16,1815,17],[1816,16,1816,17],[1817,16,1817,17],[1818,16,1818,17],[1819,16,1819,17],[1808,16,1808,17],[1809,16,1809,17],[1810,16,1810,17],[1811,16,1811,17],[1812,16,1812,17],[1813,16,1813,17],[1802,16,1802,17],[1803,16,1803,17],[1804,16,1804,17],[1805,16,1805,17],[1806,16,1806,17],[1807,16,1807,17],[1796,16,1796,17],[1797,16,1797,17],[1798,16,1798,17],[1799,16,1799,17],[1800,16,1800,17],[1801,16,1801,17],[1790,16,1790,17],[1791,16,1791,17],[1792,16,1792,17],[1793,16,1793,17],[1794,16,1794,17],[1795,16,1795,17],[1784,16,1784,17],[1785,16,1785,17],[1786,16,1786,17],[1787,16,1787,17],[1788,16,1788,17],[1789,16,1789,17],[1778,16,1778,17],[1779,16,1779,17],[1780,16,1780,17],[1781,16,1781,17],[1782,16,1782,17],[1783,16,1783,17],[1772,16,1772,17],[1773,16,1773,17],[1774,16,1774,17],[1775,16,1775,17],[1776,16,1776,17],[1777,16,1777,17],[1766,16,1766,17],[1767,16,1767,17],[1768,16,1768,17],[1769,16,1769,17],[1770,16,1770,17],[1771,16,1771,17],[1760,16,1760,17],[1761,16,1761,17],[1762,16,1762,17],[1763,16,1763,17],[1764,16,1764,17],[1765,16,1765,17],[1754,16,1754,17],[1755,16,1755,17],[1756,16,1756,17],[1757,16,1757,17],[1758,16,1758,17],[1759,16,1759,17],[1748,16,1748,17],[1749,16,1749,17],[1750,16,1750,17],[1751,16,1751,17],[1752,16,1752,17],[1753,16,1753,17],[1742,16,1742,17],[1743,16,1743,17],[1744,16,1744,17],[1745,16,1745,17],[1746,16,1746,17],[1747,16,1747,17],[1736,16,1736,17],[1737,16,1737,17],[1738,16,1738,17],[1739,16,1739,17],[1740,16,1740,17],[1741,16,1741,17],[1730,16,1730,17],[1731,16,1731,17],[1732,16,1732,17],[1733,16,1733,17],[1734,16,1734,17],[1735,16,1735,17],[1724,16,1724,17],[1725,16,1725,17],[1726,16,1726,17],[1727,16,1727,17],[1728,16,1728,17],[1729,16,1729,17],[1718,16,1718,17],[1719,16,1719,17],[1720,16,1720,17],[1721,16,1721,17],[1722,16,1722,17],[1723,16,1723,17],[1712,16,1712,17],[1713,16,1713,17],[1714,16,1714,17],[1715,16,1715,17],[1716,16,1716,17],[1717,16,1717,17],[1706,16,1706,17],[1707,16,1707,17],[1708,16,1708,17],[1709,16,1709,17],[1710,16,1710,17],[1711,16,1711,17],[1700,16,1700,17],[1701,16,1701,17],[1702,16,1702,17],[1703,16,1703,17],[1704,16,1704,17],[1705,16,1705,17],[1694,16,1694,17],[1695,16,1695,17],[1696,16,1696,17],[1697,16,1697,17],[1698,16,1698,17],[1699,16,1699,17],[1688,16,1688,17],[1689,16,1689,17],[1690,16,1690,17],[1691,16,1691,17],[1692,16,1692,17],[1693,16,1693,17],[1682,16,1682,17],[1683,16,1683,17],[1684,16,1684,17],[1685,16,1685,17],[1686,16,1686,17],[1687,16,1687,17],[1676,16,1676,17],[1677,16,1677,17],[1678,16,1678,17],[1679,16,1679,17],[1680,16,1680,17],[1681,16,1681,17],[1670,16,1670,17],[1671,16,1671,17],[1672,16,1672,17],[1673,16,1673,17],[1674,16,1674,17],[1675,16,1675,17],[1664,16,1664,17],[1665,16,1665,17],[1666,16,1666,17],[1667,16,1667,17],[1668,16,1668,17],[1669,16,1669,17],[1658,16,1658,17],[1659,16,1659,17],[1660,16,1660,17],[1661,16,1661,17],[1662,16,1662,17],[1663,16,1663,17],[1652,16,1652,17],[1653,16,1653,17],[1654,16,1654,17],[1655,16,1655,17],[1656,16,1656,17],[1657,16,1657,17],[1646,16,1646,17],[1647,16,1647,17],[1648,16,1648,17],[1649,16,1649,17],[1650,16,1650,17],[1651,16,1651,17],[1640,16,1640,17],[1641,16,1641,17],[1642,16,1642,17],[1643,16,1643,17],[1644,16,1644,17],[1645,16,1645,17],[1634,16,1634,17],[1635,16,1635,17],[1636,16,1636,17],[1637,16,1637,17],[1638,16,1638,17],[1639,16,1639,17],[1628,16,1628,17],[1629,16,1629,17],[1630,16,1630,17],[1631,16,1631,17],[1632,16,1632,17],[1633,16,1633,17],[1622,16,1622,17],[1623,16,1623,17],[1624,16,1624,17],[1625,16,1625,17],[1626,16,1626,17],[1627,16,1627,17],[1616,16,1616,17],[1617,16,1617,17],[1618,16,1618,17],[1619,16,1619,17],[1620,16,1620,17],[1621,16,1621,17],[1610,16,1610,17],[1611,16,1611,17],[1612,16,1612,17],[1613,16,1613,17],[1614,16,1614,17],[1615,16,1615,17],[1604,16,1604,17],[1605,16,1605,17],[1606,16,1606,17],[1607,16,1607,17],[1608,16,1608,17],[1609,16,1609,17],[1598,16,1598,17],[1599,16,1599,17],[1600,16,1600,17],[1601,16,1601,17],[1602,16,1602,17],[1603,16,1603,17],[1592,16,1592,17],[1593,16,1593,17],[1594,16,1594,17],[1595,16,1595,17],[1596,16,1596,17],[1597,16,1597,17],[1586,16,1586,17],[1587,16,1587,17],[1588,16,1588,17],[1589,16,1589,17],[1590,16,1590,17],[1591,16,1591,17],[1580,16,1580,17],[1581,16,1581,17],[1582,16,1582,17],[1583,16,1583,17],[1584,16,1584,17],[1585,16,1585,17],[1574,16,1574,17],[1575,16,1575,17],[1576,16,1576,17],[1577,16,1577,17],[1578,16,1578,17],[1579,16,1579,17],[1568,16,1568,17],[1569,16,1569,17],[1570,16,1570,17],[1571,16,1571,17],[1572,16,1572,17],[1573,16,1573,17],[1562,16,1562,17],[1563,16,1563,17],[1564,16,1564,17],[1565,16,1565,17],[1566,16,1566,17],[1567,16,1567,17],[1556,16,1556,17],[1557,16,1557,17],[1558,16,1558,17],[1559,16,1559,17],[1560,16,1560,17],[1561,16,1561,17],[1550,16,1550,17],[1551,16,1551,17],[1552,16,1552,17],[1553,16,1553,17],[1554,16,1554,17],[1555,16,1555,17],[1544,16,1544,17],[1545,16,1545,17],[1546,16,1546,17],[1547,16,1547,17],[1548,16,1548,17],[1549,16,1549,17],[1538,16,1538,17],[1539,16,1539,17],[1540,16,1540,17],[1541,16,1541,17],[1542,16,1542,17],[1543,16,1543,17],[1532,16,1532,17],[1533,16,1533,17],[1534,16,1534,17],[1535,16,1535,17],[1536,16,1536,17],[1537,16,1537,17],[1526,16,1526,17],[1527,16,1527,17],[1528,16,1528,17],[1529,16,1529,17],[1530,16,1530,17],[1531,16,1531,17],[1520,16,1520,17],[1521,16,1521,17],[1522,16,1522,17],[1523,16,1523,17],[1524,16,1524,17],[1525,16,1525,17],[1514,16,1514,17],[1515,16,1515,17],[1516,16,1516,17],[1517,16,1517,17],[1518,16,1518,17],[1519,16,1519,17],[1508,16,1508,17],[1509,16,1509,17],[1510,16,1510,17],[1511,16,1511,17],[1512,16,1512,17],[1513,16,1513,17],[1502,16,1502,17],[1503,16,1503,17],[1504,16,1504,17],[1505,16,1505,17],[1506,16,1506,17],[1507,16,1507,17],[1496,16,1496,17],[1497,16,1497,17],[1498,16,1498,17],[1499,16,1499,17],[1500,16,1500,17],[1501,16,1501,17],[1490,16,1490,17],[1491,16,1491,17],[1492,16,1492,17],[1493,16,1493,17],[1494,16,1494,17],[1495,16,1495,17],[1484,16,1484,17],[1485,16,1485,17],[1486,16,1486,17],[1487,16,1487,17],[1488,16,1488,17],[1489,16,1489,17],[1478,16,1478,17],[1479,16,1479,17],[1480,16,1480,17],[1481,16,1481,17],[1482,16,1482,17],[1483,16,1483,17],[1472,16,1472,17],[1473,16,1473,17],[1474,16,1474,17],[1475,16,1475,17],[1476,16,1476,17],[1477,16,1477,17],[1466,16,1466,17],[1467,16,1467,17],[1468,16,1468,17],[1469,16,1469,17],[1470,16,1470,17],[1471,16,1471,17],[1460,16,1460,17],[1461,16,1461,17],[1462,16,1462,17],[1463,16,1463,17],[1464,16,1464,17],[1465,16,1465,17],[1454,16,1454,17],[1455,16,1455,17],[1456,16,1456,17],[1457,16,1457,17],[1458,16,1458,17],[1459,16,1459,17],[1448,16,1448,17],[1449,16,1449,17],[1450,16,1450,17],[1451,16,1451,17],[1452,16,1452,17],[1453,16,1453,17],[1442,16,1442,17],[1443,16,1443,17],[1444,16,1444,17],[1445,16,1445,17],[1446,16,1446,17],[1447,16,1447,17],[1436,16,1436,17],[1437,16,1437,17],[1438,16,1438,17],[1439,16,1439,17],[1440,16,1440,17],[1441,16,1441,17],[1430,16,1430,17],[1431,16,1431,17],[1432,16,1432,17],[1433,16,1433,17],[1434,16,1434,17],[1435,16,1435,17],[1424,16,1424,17],[1425,16,1425,17],[1426,16,1426,17],[1427,16,1427,17],[1428,16,1428,17],[1429,16,1429,17],[1418,16,1418,17],[1419,16,1419,17],[1420,16,1420,17],[1421,16,1421,17],[1422,16,1422,17],[1423,16,1423,17],[1412,16,1412,17],[1413,16,1413,17],[1414,16,1414,17],[1415,16,1415,17],[1416,16,1416,17],[1417,16,1417,17],[1406,16,1406,17],[1407,16,1407,17],[1408,16,1408,17],[1409,16,1409,17],[1410,16,1410,17],[1411,16,1411,17],[1400,16,1400,17],[1401,16,1401,17],[1402,16,1402,17],[1403,16,1403,17],[1404,16,1404,17],[1405,16,1405,17],[1394,16,1394,17],[1395,16,1395,17],[1396,16,1396,17],[1397,16,1397,17],[1398,16,1398,17],[1399,16,1399,17],[1388,16,1388,17],[1389,16,1389,17],[1390,16,1390,17],[1391,16,1391,17],[1392,16,1392,17],[1393,16,1393,17],[1382,16,1382,17],[1383,16,1383,17],[1384,16,1384,17],[1385,16,1385,17],[1386,16,1386,17],[1387,16,1387,17],[1376,16,1376,17],[1377,16,1377,17],[1378,16,1378,17],[1379,16,1379,17],[1380,16,1380,17],[1381,16,1381,17],[1370,16,1370,17],[1371,16,1371,17],[1372,16,1372,17],[1373,16,1373,17],[1374,16,1374,17],[1375,16,1375,17],[1364,16,1364,17],[1365,16,1365,17],[1366,16,1366,17],[1367,16,1367,17],[1368,16,1368,17],[1369,16,1369,17],[1358,16,1358,17],[1359,16,1359,17],[1360,16,1360,17],[1361,16,1361,17],[1362,16,1362,17],[1363,16,1363,17],[1352,16,1352,17],[1353,16,1353,17],[1354,16,1354,17],[1355,16,1355,17],[1356,16,1356,17],[1357,16,1357,17],[1346,16,1346,17],[1347,16,1347,17],[1348,16,1348,17],[1349,16,1349,17],[1350,16,1350,17],[1351,16,1351,17],[1340,16,1340,17],[1341,16,1341,17],[1342,16,1342,17],[1343,16,1343,17],[1344,16,1344,17],[1345,16,1345,17],[1334,16,1334,17],[1335,16,1335,17],[1336,16,1336,17],[1337,16,1337,17],[1338,16,1338,17],[1339,16,1339,17],[1328,16,1328,17],[1329,16,1329,17],[1330,16,1330,17],[1331,16,1331,17],[1332,16,1332,17],[1333,16,1333,17],[1322,16,1322,17],[1323,16,1323,17],[1324,16,1324,17],[1325,16,1325,17],[1326,16,1326,17],[1327,16,1327,17],[1316,16,1316,17],[1317,16,1317,17],[1318,16,1318,17],[1319,16,1319,17],[1320,16,1320,17],[1321,16,1321,17],[1310,16,1310,17],[1311,16,1311,17],[1312,16,1312,17],[1313,16,1313,17],[1314,16,1314,17],[1315,16,1315,17],[1304,16,1304,17],[1305,16,1305,17],[1306,16,1306,17],[1307,16,1307,17],[1308,16,1308,17],[1309,16,1309,17],[1298,16,1298,17],[1299,16,1299,17],[1300,16,1300,17],[1301,16,1301,17],[1302,16,1302,17],[1303,16,1303,17],[1292,16,1292,17],[1293,16,1293,17],[1294,16,1294,17],[1295,16,1295,17],[1296,16,1296,17],[1297,16,1297,17],[1286,16,1286,17],[1287,16,1287,17],[1288,16,1288,17],[1289,16,1289,17],[1290,16,1290,17],[1291,16,1291,17],[1280,16,1280,17],[1281,16,1281,17],[1282,16,1282,17],[1283,16,1283,17],[1284,16,1284,17],[1285,16,1285,17],[1274,16,1274,17],[1275,16,1275,17],[1276,16,1276,17],[1277,16,1277,17],[1278,16,1278,17],[1279,16,1279,17],[1268,16,1268,17],[1269,16,1269,17],[1270,16,1270,17],[1271,16,1271,17],[1272,16,1272,17],[1273,16,1273,17],[1262,16,1262,17],[1263,16,1263,17],[1264,16,1264,17],[1265,16,1265,17],[1266,16,1266,17],[1267,16,1267,17],[1256,16,1256,17],[1257,16,1257,17],[1258,16,1258,17],[1259,16,1259,17],[1260,16,1260,17],[1261,16,1261,17],[1250,16,1250,17],[1251,16,1251,17],[1252,16,1252,17],[1253,16,1253,17],[1254,16,1254,17],[1255,16,1255,17],[1244,16,1244,17],[1245,16,1245,17],[1246,16,1246,17],[1247,16,1247,17],[1248,16,1248,17],[1249,16,1249,17],[1238,16,1238,17],[1239,16,1239,17],[1240,16,1240,17],[1241,16,1241,17],[1242,16,1242,17],[1243,16,1243,17],[1232,16,1232,17],[1233,16,1233,17],[1234,16,1234,17],[1235,16,1235,17],[1236,16,1236,17],[1237,16,1237,17],[1226,16,1226,17],[1227,16,1227,17],[1228,16,1228,17],[1229,16,1229,17],[1230,16,1230,17],[1231,16,1231,17],[1220,16,1220,17],[1221,16,1221,17],[1222,16,1222,17],[1223,16,1223,17],[1224,16,1224,17],[1225,16,1225,17],[1214,16,1214,17],[1215,16,1215,17],[1216,16,1216,17],[1217,16,1217,17],[1218,16,1218,17],[1219,16,1219,17],[1208,16,1208,17],[1209,16,1209,17],[1210,16,1210,17],[1211,16,1211,17],[1212,16,1212,17],[1213,16,1213,17],[1202,16,1202,17],[1203,16,1203,17],[1204,16,1204,17],[1205,16,1205,17],[1206,16,1206,17],[1207,16,1207,17],[1196,16,1196,17],[1197,16,1197,17],[1198,16,1198,17],[1199,16,1199,17],[1200,16,1200,17],[1201,16,1201,17],[1190,16,1190,17],[1191,16,1191,17],[1192,16,1192,17],[1193,16,1193,17],[1194,16,1194,17],[1195,16,1195,17],[1184,16,1184,17],[1185,16,1185,17],[1186,16,1186,17],[1187,16,1187,17],[1188,16,1188,17],[1189,16,1189,17],[1178,16,1178,17],[1179,16,1179,17],[1180,16,1180,17],[1181,16,1181,17],[1182,16,1182,17],[1183,16,1183,17],[1172,16,1172,17],[1173,16,1173,17],[1174,16,1174,17],[1175,16,1175,17],[1176,16,1176,17],[1177,16,1177,17],[1166,16,1166,17],[1167,16,1167,17],[1168,16,1168,17],[1169,16,1169,17],[1170,16,1170,17],[1171,16,1171,17],[1160,16,1160,17],[1161,16,1161,17],[1162,16,1162,17],[1163,16,1163,17],[1164,16,1164,17],[1165,16,1165,17],[1154,16,1154,17],[1155,16,1155,17],[1156,16,1156,17],[1157,16,1157,17],[1158,16,1158,17],[1159,16,1159,17],[1148,16,1148,17],[1149,16,1149,17],[1150,16,1150,17],[1151,16,1151,17],[1152,16,1152,17],[1153,16,1153,17],[1142,16,1142,17],[1143,16,1143,17],[1144,16,1144,17],[1145,16,1145,17],[1146,16,1146,17],[1147,16,1147,17],[1136,16,1136,17],[1137,16,1137,17],[1138,16,1138,17],[1139,16,1139,17],[1140,16,1140,17],[1141,16,1141,17],[1130,16,1130,17],[1131,16,1131,17],[1132,16,1132,17],[1133,16,1133,17],[1134,16,1134,17],[1135,16,1135,17],[1124,16,1124,17],[1125,16,1125,17],[1126,16,1126,17],[1127,16,1127,17],[1128,16,1128,17],[1129,16,1129,17],[1118,16,1118,17],[1119,16,1119,17],[1120,16,1120,17],[1121,16,1121,17],[1122,16,1122,17],[1123,16,1123,17],[1112,16,1112,17],[1113,16,1113,17],[1114,16,1114,17],[1115,16,1115,17],[1116,16,1116,17],[1117,16,1117,17],[1106,16,1106,17],[1107,16,1107,17],[1108,16,1108,17],[1109,16,1109,17],[1110,16,1110,17],[1111,16,1111,17],[1100,16,1100,17],[1101,16,1101,17],[1102,16,1102,17],[1103,16,1103,17],[1104,16,1104,17],[1105,16,1105,17],[1094,16,1094,17],[1095,16,1095,17],[1096,16,1096,17],[1097,16,1097,17],[1098,16,1098,17],[1099,16,1099,17],[1088,16,1088,17],[1089,16,1089,17],[1090,16,1090,17],[1091,16,1091,17],[1092,16,1092,17],[1093,16,1093,17],[1082,16,1082,17],[1083,16,1083,17],[1084,16,1084,17],[1085,16,1085,17],[1086,16,1086,17],[1087,16,1087,17],[1076,16,1076,17],[1077,16,1077,17],[1078,16,1078,17],[1079,16,1079,17],[1080,16,1080,17],[1081,16,1081,17],[1070,16,1070,17],[1071,16,1071,17],[1072,16,1072,17],[1073,16,1073,17],[1074,16,1074,17],[1075,16,1075,17],[1064,16,1064,17],[1065,16,1065,17],[1066,16,1066,17],[1067,16,1067,17],[1068,16,1068,17],[1069,16,1069,17],[1058,16,1058,17],[1059,16,1059,17],[1060,16,1060,17],[1061,16,1061,17],[1062,16,1062,17],[1063,16,1063,17],[1052,16,1052,17],[1053,16,1053,17],[1054,16,1054,17],[1055,16,1055,17],[1056,16,1056,17],[1057,16,1057,17],[1046,16,1046,17],[1047,16,1047,17],[1048,16,1048,17],[1049,16,1049,17],[1050,16,1050,17],[1051,16,1051,17],[1040,16,1040,17],[1041,16,1041,17],[1042,16,1042,17],[1043,16,1043,17],[1044,16,1044,17],[1045,16,1045,17],[1034,16,1034,17],[1035,16,1035,17],[1036,16,1036,17],[1037,16,1037,17],[1038,16,1038,17],[1039,16,1039,17],[1028,16,1028,17],[1029,16,1029,17],[1030,16,1030,17],[1031,16,1031,17],[1032,16,1032,17],[1033,16,1033,17],[1022,16,1022,17],[1023,16,1023,17],[1024,16,1024,17],[1025,16,1025,17],[1026,16,1026,17],[1027,16,1027,17],[1016,16,1016,17],[1017,16,1017,17],[1018,16,1018,17],[1019,16,1019,17],[1020,16,1020,17],[1021,16,1021,17],[1010,16,1010,17],[1011,16,1011,17],[1012,16,1012,17],[1013,16,1013,17],[1014,16,1014,17],[1015,16,1015,17],[1004,16,1004,17],[1005,16,1005,17],[1006,16,1006,17],[1007,16,1007,17],[1008,16,1008,17],[1009,16,1009,17],[998,16,998,17],[999,16,999,17],[1000,16,1000,17],[1001,16,1001,17],[1002,16,1002,17],[1003,16,1003,17],[992,16,992,17],[993,16,993,17],[994,16,994,17],[995,16,995,17],[996,16,996,17],[997,16,997,17],[986,16,986,17],[987,16,987,17],[988,16,988,17],[989,16,989,17],[990,16,990,17],[991,16,991,17],[980,16,980,17],[981,16,981,17]],"merged_total":2029,"flags":["merged_cut"]}
[null,null,null,null,null,null,"Integration of Information Technologies (IT) in SMBs"]
["Appendix A – Application for a Contract Certificate \n"]
["List of subcontractors supplying the management software package"]
["(Appendix A is an integral part of this application for a certificate.)"]
[null,null,"Corporation or partnership name  (Be sure to read note 1 carefully)",null,null,null,null,null,null,null,"NEQ","IQ business number",null,null,null,"IQ file number"]
[null,null,{"$f":"IF(Application!A10=\"\",\"\",Application!A10)","v":""},null,null,null,null,null,null,null,{"$f":"IF(Application!A12=\"\",\"\",Application!A12)","v":""},null,{"$f":"IF(Application!K12=\"\",\"\",Application!K12)","v":""},null,null,{"$f":"IF(Application!U12=\"\",\"\",Application!U12)","v":""}]
[]
[]
{"$rows_left_out":23}
{"sheet":"Appendix B","index":3,"n_rows":25,"n_cols":8,"rows_kept":25,"cut":false,"hidden":false,"merged":[[24,0,24,1],[25,1,25,7],[26,1,26,7],[27,1,27,10],[17,1,17,7],[19,1,19,7],[20,0,20,1],[21,1,21,7],[22,0,22,1],[23,1,23,7],[16,1,16,7],[6,0,7,1],[6,2,7,2],[6,3,7,3],[6,4,7,4],[6,5,7,5],[6,6,7,6],[6,7,7,7],[8,1,8,7],[9,0,9,1],[11,1,11,7],[14,1,14,7],[5,2,5,7],[0,4,0,7],[1,0,1,7],[2,0,2,7],[3,0,3,7],[4,1,4,7]]}
[null,null,null,null,"Integration of Information Technologies (IT) in SMBs"]
["Appendix B – Application for a Contract Certificate  "]
["Supply of a Qualified Management Software Package"]
["(Appendix B is an integral part of this application for a certificate.)\nFor each subcontractor, please indicate the amount attributable to each activity included in the supply of a qualified management software package."]
[]
[null,null,"Names of subcontractors and amounts attributable to each activity"]
["Activity",null,"Subcontractor 1","Amount","Subcontractor 2","Amount","Subcontractor 3","Amount"]
[]
{"$rows_left_out":17}