{"text_format":"1","workbook":"xlsx","n_sheets":3,"sheets":["Instructions","Renseignements Gén.","Financement"],"not_rendered":{"charts":0,"images":3,"macros":1,"external_links":1,"defined_names":31,"comments":1,"pivot_tables":0},"unopened":[],"bounds":{"document_bytes":16777216,"sheet_cells":100000,"rows_first":2000,"rows_last":500,"rows_between":2000,"halvings":0,"cell_chars":16384,"cell_head_chars":4096},"cells_cut":0,"cells_raw":0,"read":"whole","date_system":"1900"}

{"sheet":"Instructions","index":0,"n_rows":157,"n_cols":4,"rows_kept":157,"cut":false,"hidden":false,"merged":[[99,1,99,2],[2,1,2,2],[3,1,3,2],[77,0,77,3],[86,1,86,2],[92,1,92,2]]}
[]
[null,null,null,"Financement des crédits d'impôt à l'investissement relatifs au matériel de fabrication et de transformation"]
[null,"DEMANDE DE GARANTIE / PRÊT"]
[null,"Instructions"]
[]
[]
[]
[]
[]
[]
[]
[]
[]
[]
[]
[]
[]
[]
[]
[]
[]
[]
[]
[]
[]
[]
[]
[]
[]
[]
[]
[]
[]
[]
[]
[]
[]
[]
[]
[]
[]
[]
[]
[]
[]
[]
[]
[]
[]
[]
[]
[]
[]
[]
[]
[]
[]
[]
[]
[]
[]
[]
[]
[]
[]
[]
[]
[]
[]
[]
[]
[]
[]
[]
[]
[]
[]
[]
[]
[]
[]
[]
[]
[]
[]
[]
[]
[]
[]
[]
[]
[]
[null,"Points de services d'Investissement Québec :"]
[]
[]
[]
[]
[]
[]
[]
[]
[]
[]
[]
[]
[]
[]
[]
[]
[]
[]
[]
[]
[]
[]
[]
[]
[]
[]
[]
[]
[]
[]
[]
[]
[]
[]
[]
[]
[]
[]
[]
[]
[]
[]
[]
[]
[]
[]
[]
[]
[]
[]
[]
[]
[]
[]
[]
[]
[]
[]
[]
[]
[]
[]
[]
[null,"Numéro sans frais au Québec : 1 866 870-0437"]

{"sheet":"Renseignements Gén.","index":1,"n_rows":403,"n_cols":19,"rows_kept":403,"cut":false,"hidden":false,"merged":[[87,1,87,5],[80,1,80,5],[78,1,78,5],[268,1,268,16],[252,1,252,3],[254,1,254,7],[122,9,122,10],[89,10,90,11],[91,14,91,15],[120,11,120,14],[122,11,122,14],[102,1,102,15],[95,1,95,15],[105,1,105,15],[237,0,237,16],[98,1,98,15],[123,3,123,5],[156,12,156,15],[147,4,155,8],[238,0,238,16],[242,1,242,3],[240,1,240,16],[90,1,90,5],[121,3,121,5],[404,5,404,9],[289,1,289,3],[378,0,378,16],[330,1,330,4],[330,6,330,7],[330,12,330,14],[330,8,330,11],[333,8,333,11],[376,1,376,16],[288,7,289,8],[343,12,343,14],[340,12,341,14],[335,8,335,11],[334,8,334,11],[332,8,332,11],[327,12,327,14],[323,8,323,11],[288,10,289,11],[290,10,290,11],[290,12,290,13],[317,1,317,4],[331,12,331,14],[288,12,289,13],[316,1,316,4],[316,8,316,11],[316,6,316,7],[17,1,17,5],[20,11,20,15],[58,11,58,13],[58,4,58,10],[75,1,75,5],[75,12,76,13],[71,1,71,5],[63,4,63,8],[63,12,63,15],[75,6,76,9],[70,1,70,5],[71,14,72,15],[71,12,72,13],[70,10,70,11],[70,12,70,13],[71,6,72,9],[85,1,85,5],[165,13,165,15],[77,1,77,5],[86,1,86,5],[76,1,76,5],[89,1,89,5],[392,13,392,15],[332,6,332,7],[392,6,392,12],[340,15,341,15],[340,8,341,11],[58,14,58,15],[61,10,61,15],[75,14,76,15],[77,12,78,13],[77,14,78,15],[73,14,74,15],[77,10,78,11],[77,6,78,9],[79,14,80,15],[81,14,82,15],[79,12,80,13],[87,12,88,13],[87,6,88,9],[89,12,90,13],[118,1,118,15],[120,9,120,10],[120,6,120,8],[87,10,88,11],[89,6,90,9],[41,0,41,16],[53,1,53,16],[59,4,59,10],[116,1,116,15],[120,1,120,2],[122,6,122,8],[107,1,107,15],[110,1,110,15],[112,1,112,15],[120,3,120,5],[89,14,90,15],[121,9,121,10],[73,1,73,5],[74,1,74,5],[88,1,88,5],[75,10,76,11],[73,10,74,11],[70,6,70,9],[68,1,68,16],[72,1,72,5],[73,6,74,9],[70,14,70,15],[71,10,72,11],[73,12,74,13],[79,1,79,5],[83,1,83,5],[81,1,81,5],[82,1,82,5],[83,6,84,9],[79,6,80,9],[79,10,80,11],[85,14,86,15],[81,10,82,11],[81,12,82,13],[83,14,84,15],[83,12,84,13],[85,12,86,13],[84,1,84,5],[83,10,84,11],[81,6,82,9],[85,10,86,11],[85,6,86,9],[19,1,19,5],[23,1,23,5],[18,9,18,15],[28,6,28,8],[26,6,26,15],[7,7,7,15],[8,7,8,15],[5,1,5,16],[293,10,293,11],[291,12,291,13],[292,7,292,8],[290,1,290,5],[290,14,290,15],[286,1,286,16],[21,11,21,15],[20,3,20,7],[22,11,22,15],[24,6,24,15],[292,10,292,11],[292,1,292,5],[157,12,157,15],[160,13,160,15],[288,14,289,15],[87,14,88,15],[359,1,359,15],[343,6,343,7],[338,8,338,11],[325,1,325,4],[325,6,325,7],[2,0,2,16],[3,0,3,16],[14,5,14,15],[11,5,11,15],[12,5,12,15],[10,5,10,15],[25,6,25,15],[39,13,39,15],[56,6,56,15],[54,1,54,16],[39,6,39,8],[40,13,40,15],[40,6,40,8],[32,1,32,16],[36,6,36,15],[36,1,36,5],[15,5,15,15],[16,5,16,15],[28,13,28,15],[331,1,331,4],[318,6,318,7],[319,1,319,4],[327,1,327,4],[323,1,323,4],[335,12,335,14],[390,13,391,15],[317,8,317,11],[292,14,292,15],[292,12,292,13],[390,6,391,12],[329,8,329,11],[331,8,331,11],[318,8,318,11],[319,8,319,11],[316,12,316,14],[340,6,341,7],[313,1,313,15],[336,12,336,14],[328,6,328,7],[328,8,328,11],[325,8,325,11],[319,6,319,7],[314,1,314,15],[318,1,318,4],[321,12,321,14],[322,1,322,4],[321,1,321,4],[321,6,321,7],[322,6,322,7],[326,8,326,11],[325,12,325,14],[326,12,326,14],[320,1,320,4],[335,6,335,7],[336,6,336,7],[320,6,320,7],[336,8,336,11],[317,12,317,14],[291,10,291,11],[293,14,293,15],[291,14,291,15],[317,6,317,7],[291,7,291,8],[293,12,293,13],[324,12,324,14],[323,6,323,7],[323,12,323,14],[324,8,324,11],[293,7,293,8],[322,12,322,14],[326,6,326,7],[327,6,327,7],[328,12,328,14],[334,12,334,14],[333,12,333,14],[329,12,329,14],[332,12,332,14],[206,1,206,11],[163,12,163,15],[225,1,225,11],[226,1,226,11],[227,1,227,11],[231,1,231,11],[235,12,235,13],[232,12,232,13],[233,12,233,13],[234,12,234,13],[208,1,208,11],[162,1,167,3],[216,1,216,11],[229,11,229,12],[169,1,169,15],[170,1,170,15],[176,1,176,15],[178,1,178,15],[180,1,180,15],[221,1,221,11],[226,13,226,14],[217,1,217,11],[218,1,218,11],[220,1,220,11],[151,13,151,15],[152,13,152,15],[146,1,146,3],[146,4,146,8],[147,1,155,3],[147,9,155,11],[136,7,136,9],[162,4,167,8],[149,12,149,15],[162,12,162,15],[156,4,161,8],[166,13,166,15],[156,9,161,11],[144,1,144,5],[328,1,328,4],[333,1,333,4],[290,7,290,8],[318,12,318,14],[319,12,319,14],[320,12,320,14],[123,11,123,14],[121,6,121,8],[123,6,123,8],[122,3,122,5],[121,11,121,14],[123,1,123,2],[121,1,121,2],[122,1,122,2],[123,9,123,10],[128,1,128,15],[130,1,130,15],[132,1,132,15],[134,1,134,15],[140,1,140,15],[142,1,142,15],[162,9,167,11],[146,12,146,15],[146,9,146,11],[395,13,396,15],[337,8,337,11],[402,1,403,3],[339,12,339,14],[392,1,392,5],[340,5,341,5],[284,1,284,16],[291,1,291,5],[335,1,335,4],[336,1,336,4],[329,6,329,7],[331,6,331,7],[320,8,320,11],[322,8,322,11],[321,8,321,11],[327,8,327,11],[334,6,334,7],[324,6,324,7],[334,1,334,4],[329,1,329,4],[332,1,332,4],[333,6,333,7],[324,1,324,4],[326,1,326,4],[222,13,222,14],[224,13,224,14],[224,1,224,11],[213,13,213,14],[215,13,215,14],[222,1,222,11],[405,5,405,9],[395,1,396,5],[395,6,396,12],[337,12,337,14],[397,1,397,5],[397,6,397,12],[397,13,397,15],[339,6,339,7],[337,6,337,7],[390,1,391,5],[338,1,338,4],[337,1,337,4],[338,12,338,14],[343,1,343,4],[403,5,403,9],[338,6,338,7],[340,1,341,4],[339,1,339,4],[223,1,223,11],[215,1,215,11],[155,12,155,15],[159,13,159,15],[156,1,161,3],[206,13,206,14],[339,8,339,11],[209,1,209,11],[209,13,209,14],[184,1,184,16],[233,14,233,15],[234,1,234,10],[234,14,234,15],[218,13,218,14],[220,13,220,14],[232,1,232,10],[232,14,232,15],[293,1,293,5],[235,1,235,10],[217,13,217,15],[235,14,235,15],[233,1,233,10],[211,1,211,11],[212,1,212,11]]}
[null,null,null,null,null,null,null,null,null,null,null,null,null,null,null,"Financement des crédits d'impôt à l'investissement relatifs au matériel de fabrication et de transformation"]
[null,null,null,null,null,null,null,null,null,null,null,null,null,null,null,{"$f":"I8","v":0}]
["DEMANDE DE GARANTIE / PRÊT"]
["Renseignements généraux"]
[]
["1.","IDENTIFICATION"]
[]
[null,"Raison sociale exacte de l'entreprise requérante :",null,null,null,null,null," "]
[null,"NEQ (numéro d'entreprise du Québec) :"]
[]
[null,"Adresse du siège social :"]
[]
[]
[]
[null,"Adresse du bureau principal :"]
[null,"(si différente de celle"]
[null," du siège social)"]
[]
[null,"Personne avec qui Investissement Québec devra communiquer :"]
[]
[null,"Titre :",null,null,null,null,null,null,null,null,"Téléphone :"]
[null,null,null,null,null,null,null,null,null,null,"Télécopieur :"]
[null,null,null,null,null,null,null,null,null,null,"Courrier électronique :"]
[]
[null,"Adresse (si différente de celle "]
[null,null,null,"du siège social) :"]
[]
[]
[null,"Nombre d'employés avant le projet :",null,null,null,null,null,null,null,null,null,null," après le projet :"]
[]
[]
[]
["2.","RENSEIGNEMENTS SUR L'ENTREPRISE ET LE PRÊT DEMANDÉ"]
[]
[]
[null,"Numéro d'enregistrement auprès du"]
[null,"ministère du Revenu du Québec :"]
[null,null,null,null,null,null,"(voir « Déclaration des sociétés », CO-17)"]
[]
[null,"Date d'incorporation :",null,null,null,null,null,null,null,null,null,null,"Début des activités :"]
[null,null,null,null,null,null,"(aaaa-mm-jj)",null,null,null,null,null,null,"(aaaa-mm-jj)"]
[]
[null,"L'entreprise est-elle associée (au sens de la Loi sur les impôts) à d'autres entreprises?"]
[null,"(le cas échéant, annexez la liste et l'organigramme à votre demande)"]
[]
[null,"L'entreprise a-t-elle des arrérages à quelque titre que ce soit envers l'Agence"]
[null,"du revenu du Canada ou le ministère du Revenu du Québec?"]
[]
[null,"Existe-t-il un litige ou un avis d'opposition en cours auprès de l'Agence "]
[null,"du revenu du Canada ou du ministère du Revenu du Québec?"]
[null,"(le cas échéant, annexez les détails à votre demande)"]
[]
[]
[]
["3.","RENSEIGNEMENTS SUR L'INSTITUTION FINANCIÈRE"]
[]
[null,"Nom du prêteur (raison sociale) :"]
[]
[null,"Adresse (succursale) :",null,null,null,null,null,null,null,null,null,"    Numéro de transit :"]
[]
[]
[null,"Nom de la personne responsable du compte à l'institution financière :"]
[]
[null,"Téléphone :",null,null,null,null,null,null,null,null,"Télécopieur :"]
[]
[]
[]
[]
["4.","ACTIONNARIAT ET DIRECTION"]
[]
[null,"Nom et adresse",null,null,null,null,"Titre ou fonction dans l'entreprise (si l'actionnaire n'est pas à l'emploi de l'entreprise, inscrivez s.o.",null,null,null,"Nbre d'années au sein de l'industrie",null,"Nbre d'années au sein de l'entreprise",null,"% d'actions votantes détenues"]
[]
[]
[]
[]
[]
[]
[]
[]
[]
[]
[]
[]
[]
[]
[]
[]
[]
[]
[]
[]
[null,null,null,null,null,null,null,null,null,null,null,null,null,"Total :",{"$f":"IF(SUM(O72:P91)=0,\"\",SUM(O72:P91))","v":""}]
[]
[]
[]
["5.","ADMISSIBILITÉ AUX CRÉDITS D'IMPÔT"]
["  "]
[null,"5.1 Société admissible"]
[null,"Toute société ou société de personnes dont elle est membre directement ou indirectement, autre qu’une société exclue, qui au cours d’une année d'imposition, exploitera une entreprise au Québec et y aura un établissement pourra, à certaines conditions, bénéficier du crédit d’impôt à l’investissement à l’égard de cette année d’imposition."]
[]
[null,"L’expression « société exclue », à l’égard d‘une année d’imposition, désignera :"]
[]
[null,"    −    une société exonérée d’impôt pour l’année;\n    −    une société de la couronne ou une filiale entièrement contrôlée d’une telle société;\n    −    une société de production d’aluminium;\n    −    une société de raffinage de pétrole."]
[]
[null,"5.2 Investissement admissible"]
[null,"Un investissement admissible est un bien de la catégorie 43 (matériel de fabrication et de transformation) ou un bien de la catégorie 29 acquis en 2008-2009. Pour que ce bien soit admissible, il doit s’agir d’un bien neuf utilisé uniquement au Québec et principalement dans le cadre de l’exploitation d’une entreprise. La société doit avoir commencé à utiliser ce bien dans un délai raisonnable après son acquisition et elle doit l'utiliser pendant une période minimale de 730 jours."]
[]
[null,"Le montant d’un investissement admissible d’une société, pour une année d’imposition, correspondra à la partie du coût en capital de l’investissement admissible qui est engagée dans l’année par la société."]
[]
[null,"Les biens devront être acquis après le 13 mars 2008 mais avant le 1er janvier 2016, sauf :"]
[null,"    −    s’ils sont acquis conformément à une obligation écrite contractée au plus tard le 13 mars 2008;\n    −    si leur construction par le contribuable ou pour celui-ci, était commencée le 13 mars 2008."]
[]
[null,"Le montant de l’investissement admissible devra être réduit du montant de toute aide gouvernementale, de toute aide non gouvernementale et de tout bénéfice ou avantage, selon les règles usuelles."]
[]
[null,"La dépense doit avoir été payée au moment où la société demande le crédit d’impôt à l’investissement."]
[]
[null,"Le crédit d’impôt à l’investissement fédéral ne constituera pas une aide gouvernementale dans la détermination du montant d’un investissement admissible au crédit d’impôt à l’investissement."]
[]
[null,"5.3 Historique d'encaissement"]
[]
[null,"Année",null,"Palier",null,null,"Montant demandé",null,null,"Date de dépôt du rapport d'impôt",null,"  Montant reçu",null,null,null,"Date"]
[null,null,null,"Provincial"]
[null,null,null,"Provincial"]
[null,null,null,"Provincial"]
[]
[]
[]
[]
[null,"5.4 Capital versé calculé sur une base consolidée"]
[]
[null,"Le capital versé d’une société, calculé sur une base consolidée, servira à établir le taux du crédit d’impôt à l’investissement applicable ainsi que le taux de remboursement de ce crédit d’impôt."]
[]
[null,"Le capital versé devra être déterminé sur une base mondiale, en considérant le capital versé attribuable aux sociétés associées, y compris celui des sociétés associées qui ne sont pas assujetties à la Loi sur les impôts."]
[]
[null,"Le capital versé de la société admissible applicable à cette année d’imposition donnée sera celui déterminé pour son année d’imposition précédente. S'il s'agit du premier exercice financier de la société, le capital versé sera celui déterminé sur la base de son bilan d’ouverture préparé conformément aux principes comptables généralement reconnus."]
[]
[null,"Capital versé de l'année d'imposition précédente :"]
[]
[null,"5.5 Taux du crédit"]
[]
[null,"Le taux du crédit d’impôt à l’investissement est de 5 %."]
[]
[null,"Ce taux est majoré à 20 % lorsque l’investissement admissible est réalisé dans une zone intermédiaire, à 30 % lorsque cet investissement est réalisé dans la région du Bas-Saint-Laurent et à 40 % lorsque cet investissement est réalisé dans une zone éloignée."]
[]
[null,"Veuillez sélectionner une zone",null,null,null,null,null,"Taux du crédit :",null,{"$f":"IF(B145<>\"Veuillez sélectionner une zone\",IF(H137<250000000,S148,IF(H137<500000000,S148-((S150*(H137-250000000))/250000000),0.05)),\"-\")","v":"-"}]
[]
[null,"ZONES",null,null,"RÉGIONS",null,null,null,null,"CAPITAL VERSÉ DE L'ANNÉE D'IMPOSITION PRÉCÉDENTE < 250 M$",null,null,"CAPITAL VERSÉ DE L'ANNÉE D'IMPOSITION PRÉCÉDENTE \n> 250 M$ < 500 M$"]
[null,"Zones intermédiaires",null,null," - Saguenay–Lac St-Jean (02)\n - Mauricie (04)\n - MRC de la Vallée-de-la-Gatineau (50)\n - MRC de Pontiac (51)\n - MRC d'Antoine-Labelle (52)",null,null,null,null,"  TC11 = 20 %",null,null,null,null,null,null,null,null,{"$f":"IF(B145=B148,20%,IF(B145=B157,30%,IF(B145=B163,40%)))","v":false}]
[]
[null,null,null,null,null,null,null,null,null,null,null,null,"TC11 = 20 % -",null,null,null,null,null,{"$f":"IF(B145=B148,15%,IF(B145=B157,25%,IF(B145=B163,35%)))","v":false}]
[]
[null,null,null,null,null,null,null,null,null,null,null,null,null," 15 % X (Capital versé - 250 M$)",null,null,null,null,{"$f":"IF(S148=J145,\"\",S148&\"- (\"&S150&\" * (\"&H137&\" - 250 000 000\" & \") / 250 000 000)\")","v":"FAUX- (FAUX * ( - 250 000 000) / 250 000 000)"}]
[null,null,null,null,null,null,null,null,null,null,null,null,null,"                     250 M$"]
[]
[]
[]
[null,"Bas-Saint-Laurent",null,null," - Bas-Saint-Laurent (01)",null,null,null,null,"  TC11 = 30 %"]
[null,null,null,null,null,null,null,null,null,null,null,null,"TC11 = 30 % -"]
[]
[null,null,null,null,null,null,null,null,null,null,null,null,null,"25 % X (Capital versé - 250 M$)"]
[null,null,null,null,null,null,null,null,null,null,null,null,null,"                     250 M$"]
[]
[null,"Zones éloignées",null,null," - Abitibi-Témiscamingue (08)\n - Côte-Nord (09)\n - Nord-du-Québec (10)\n - Gaspésie - Iles-de-la-Madeleine (11)",null,null,null,null,"  TC11 = 40 %"]
[null,null,null,null,null,null,null,null,null,null,null,null,"TC11 = 40 % -"]
[]
[null,null,null,null,null,null,null,null,null,null,null,null,null,"35 % X (Capital versé - 250 M$)"]
[null,null,null,null,null,null,null,null,null,null,null,null,null,"                     250 M$"]
[]
[]
[null,"-      TC11 = Taux de crédit d’impôt à l’investissement"]
[null,"-      Capital versé : Le capital versé est calculé sur une base mondiale"]
[]
[]
[null,"À l'aide du tableau ci-dessus, établissez le taux des crédits d'impôt remboursables pour l'exercice financier se terminant le"]
[null,{"$f":"IF(ISBLANK(N207),\"(Veuillez inscrire une date à la ligne 208)\",IF(ISBLANK(P207),\"le \"& TEXT(N207,\"AAAA-MM-JJ\") & \".\",\"le \"& TEXT(N207,\"AAAA-MM-JJ\") &\" et pour l'exercice financier se terminant le \"& TEXT(P207,\"AAAA-MM-JJ\") &\".\"))","v":"(Veuillez inscrire une date à la ligne 208)"}]
[]
[null,"Si le capital versé est supérieur  ou égal à 500 M$, le taux du crédit d'impôt est de 5% ; le crédit d'impôt n'est pas remboursable dans ce cas."]
[]
[null,"La partie non remboursable du crédit d'impôt à l'investissement relatif à une année d'imposition qui excédera l'impôt et la taxe sur le capital payables pour cette année d'imposition pourra être reportée sur les trois années d'imposition précédentes ou sur les vingt années subséquentes."]
[]
[null,"Cependant, ce report ne pourra être effectué à l'égard d'une année d'imposition terminée avant le jour qui suit le discours sur le budget du 13 mars 2008."]
[]
[]
[]
["6.","PROJET"]
[]
[null,"6.1 Renseignement sur l'investissement admissible"]
[]
[]
[]
[]
[]
[]
[]
[]
[]
[]
[]
[]
[]
{"$rows_left_out":204}
{"sheet":"Financement","index":2,"n_rows":54,"n_cols":16,"rows_kept":54,"cut":false,"hidden":false,"merged":[[18,1,18,6],[12,1,12,10],[13,1,13,10],[36,14,36,15],[15,12,15,13],[35,14,35,15],[18,7,18,9],[19,1,19,13],[17,14,17,15],[18,14,18,15],[16,1,16,10],[17,1,17,10],[33,2,33,10],[30,2,30,10],[26,2,26,10],[31,2,31,10],[37,14,37,15],[11,12,11,13],[16,12,16,13],[13,14,13,15],[13,12,13,13],[14,14,14,15],[15,14,15,15],[16,14,16,15],[14,12,14,13],[17,12,17,13],[18,12,18,13],[33,12,33,13],[24,10,24,13],[30,12,30,13],[25,2,25,10],[29,2,29,10],[0,1,0,5],[4,0,4,16],[5,0,5,16],[12,14,12,15],[12,12,12,13],[11,1,11,10],[11,14,11,15],[10,11,10,13],[38,2,38,10],[37,2,37,10],[37,12,37,13],[34,12,34,13],[34,2,34,10],[36,2,36,10],[35,2,35,10],[35,12,35,13],[36,12,36,13],[32,2,32,10],[29,12,29,13],[25,14,25,15],[26,14,26,15],[26,12,26,13],[25,12,25,13],[29,14,29,15],[33,14,33,15],[34,14,34,15],[31,12,31,13],[32,12,32,13],[30,14,30,15],[31,14,31,15],[32,14,32,15]]}
[]
[null,null,null,null,null,null,null,null,null,null,null,null,null,null,null,"Financement des crédits d'impôt à l'investissement relatifs au matériel de fabrication et de transformation"]
[]
[]
["DEMANDE DE GARANTIE / PRÊT"]
["Calculs relatifs aux crédits d'impôt à financer"]
[]
[]
[null,"1. PRÊT MAXIMAL (en $)"]
[]
[]
[null,"Exercice(s) financier(s) terminé(s) le : ",null,null,null,null,null,null,null,null,null,{"$f":"'Renseignements Gén.'!L233","v":"00:00:00"},{"$f":"'Renseignements Gén.'!M233:N233","v":"00:00:00"},null,"Total"]
[null,"Crédits d'impôt remboursables (Québec) à financer",null,null,null,null,null,null,null,null,null,{"$f":"'Renseignements Gén.'!L236","v":""},{"$f":"'Renseignements Gén.'!M236:N236","v":""},null,{"$f":"IF(ISERROR(SUM(L13+M13)),\"\",SUM(L13+M13))","v":""}]
[null,"Prêt maximal à 75 %",null,null,null,null,null,null,null,null,null,{"$f":"IF(ISERROR(L13*75%),\"\",L13*75%)","v":""},{"$f":"IF(ISERROR(M13*75%),\"\",M13*75%)","v":""},null,{"$f":"IF(ISERROR(SUM(L14:N14)),\"\",SUM(L14:N14))","v":0}]
[null,"Montant financé par dossier précédent",null,null,null,null,null,null,null,"n°.",null,null,null,null,{"$f":"SUM(L15:N15)","v":0}]
[null,"Montant à financer par ce nouveau dossier",null,null,null,null,null,null,null,"n°.",null,{"$f":"IF(ISERROR(L14-L15),\" \",L14-L15)","v":" "},{"$f":"IF(ISERROR(M14-M15),\"\",M14-M15)","v":""},null,{"$f":"SUM(L16:N16)","v":0}]
[null,"Portion financée (en %)",null,null,null,null,null,null,null,null,null,{"$f":"IF(AND((L13)>0,L13<>\"\"),(L18/L13),0)","v":0},{"$f":"IF(AND((M13)>0,M13<>\"\"),(M18/M13),0)","v":0},null,{"$f":"IF(AND((O13)>0,O13<>\"\"),(O18/O13),0)","v":0}]
[null,"Crédits financés (année courante, arrondis)",null,null,null,null,null,null,null,null,null,null,null,null,{"$f":"SUM(L18:N18)","v":0}]
[null,"1er certificat de garantie annuel :",null,null,null,null,null,0.8,null,null,null,{"$f":"L18*H19","v":0},{"$f":"M18*H19","v":0}]
[null,"Le total du prêt maximal doit être supérieur à 25 000 $"]
[]
[]
[null,"2. FINANCEMENT (en $)"]
[]
[]
[null,null,"Exercice(s) financier(s) terminé(s) le : ",null,null,null,null,null,null,null,null,{"$f":"L12","v":"00:00:00"},{"$f":"M12","v":"00:00:00"},null,"Total"]
[null,null,"Total des investissements admissibles",null,null,null,null,null,null,null,null,{"$f":"IF(ISERROR('Renseignements Gén.'!N227),\"\",'Renseignements Gén.'!N227)","v":0},{"$f":"IF(ISERROR('Renseignements Gén.'!P227),\"\",'Renseignements Gén.'!P227)","v":0},null,{"$f":"SUM(L27,M27)","v":0}]
[]
[]
[null,null,"Exercice(s) financier(s) terminé(s) le : ",null,null,null,null,null,null,null,null,{"$f":"L26","v":"00:00:00"},{"$f":"M26","v":"00:00:00"},null,"Total"]
[null,null,"Actions ordinaires. - Promoteurs (mise de fonds)",null,null,null,null,null,null,null,null,null,null,null,{"$f":"SUM(M31+L31)","v":0}]
[null,null,"Actions privés - Promoteurs (mise de fonds)",null,null,null,null,null,null,null,null,null,null,null,{"$f":"SUM(M32+L32)","v":0}]
[null,null,"Avance d'actionnaires",null,null,null,null,null,null,null,null,null,null,null,{"$f":"SUM(M33+L33)","v":0}]
[null,null,"Crédits d'impôt (non financés par IQ)",null,null,null,null,null,null,null,null,{"$f":"IF(ISERROR(L13-L18),\"\",L13-L18)","v":""},{"$f":"IF(ISERROR(M13-M18),\"\",M13-M18)","v":""},null,{"$f":"IF(ISERROR(L34+M34),\"\",L34+M34)","v":""}]
[null,null,"Fonds de roulement",null,null,null,null,null,null,null,null,null,null,null,{"$f":"SUM(M35+L35)","v":0}]
[null,null,"Prêt garanti par IQ",null,null,null,null,null,null,null,null,{"$f":"L18","v":0},{"$f":"M18","v":0},null,{"$f":"L36+M36","v":0}]
[null,null,"Autre (précisez):",null,null,null,null,null,null,null,null,null,null,null,{"$f":"SUM(M37+L37)","v":0}]
[null,null,"Total :  ",null,null,null,null,null,null,null,null,{"$f":"SUM(L31:L37)","v":0},{"$f":"SUM(M31:N37)","v":0},null,{"$f":"SUM(O31:P37)","v":0}]
[null,null,"Le total des dépenses doit être égal au total du financement"]
[]
[]
[]
[null,"3. MONTANT DE LA GARANTI ET DES HONORAIRES"]
[]
[null,"Calcul du montant de la garantie"]
[null,"Montant du prêt",null,null,null,null,null,null,null,null,null,{"$f":"O18","v":0}]
[]
[null,"Montant de la garantie à 80 %",null,null,null,null,null,null,null,null,null,{"$f":"L46*0.8","v":0}]
[]
[null,"Calcul des honoraires"]
[null,"Honoraires de garantie (2,5 % du prêt)",null,null,null,null,null,null,null,null,null,{"$f":"L46*0.025","v":0}]
[null,"Frais d'étude (1,0 % du prêt)",null,null,null,null,null,null,null,null,null,{"$f":"L46*0.01","v":0}]
[]
[null,null,null,null,null,null,null,null,"Total",null,null,{"$f":"L51+L52","v":0}]