{"text_format":"1","workbook":"xlsx","n_sheets":5,"sheets":["Instructions","General Information","Year 1 CALCULATIONS","Year 2 CALCULATIONS","Financing"],"not_rendered":{"charts":0,"images":12,"macros":1,"external_links":0,"defined_names":467,"comments":4,"pivot_tables":0},"unopened":[],"bounds":{"document_bytes":16777216,"sheet_cells":100000,"rows_first":2000,"rows_last":500,"rows_between":2000,"halvings":0,"cell_chars":16384,"cell_head_chars":4096},"cells_cut":0,"cells_raw":0,"read":"whole","date_system":"1900"}

{"sheet":"Instructions","index":0,"n_rows":120,"n_cols":6,"rows_kept":120,"cut":false,"hidden":false,"merged":[[59,0,59,16],[0,5,0,16],[2,0,2,16],[3,0,3,16]]}
[null,null,null,null,null,"Financing of Refundable R&D Tax Credits"]
[]
["LOAN / GUARANTEE APPLICATION"]
["Instructions"]
[]
[]
[]
[]
[]
[]
[]
[]
[]
[]
[]
[]
[]
[]
[]
[]
[]
[]
[]
[]
[]
[]
[]
[]
[]
[]
{"$rows_left_out":91}
{"sheet":"General Information","index":1,"n_rows":241,"n_cols":25,"rows_kept":241,"cut":false,"hidden":false,"merged":[[89,14,89,15],[4,1,4,7],[20,1,20,5],[12,5,12,15],[13,5,13,15],[18,1,18,5],[19,1,19,8],[15,5,15,15],[10,5,11,15],[88,9,88,10],[78,3,78,6],[85,11,85,13],[26,6,26,15],[25,6,25,15],[83,11,84,13],[66,4,66,10],[29,6,29,8],[86,11,86,13],[85,3,85,5],[42,0,42,16],[61,1,61,16],[34,6,34,15],[85,14,85,15],[83,14,84,15],[105,1,105,16],[108,14,109,15],[108,1,108,5],[110,10,111,11],[90,9,90,10],[108,12,109,13],[107,14,107,15],[107,1,107,5],[108,6,109,9],[109,1,109,5],[107,12,107,13],[107,10,107,11],[108,10,109,11],[107,6,107,9],[114,1,114,5],[0,7,0,15],[114,12,115,13],[114,10,115,11],[88,11,88,13],[89,11,89,13],[90,14,90,15],[89,6,89,8],[88,6,88,8],[110,1,110,5],[111,1,111,5],[89,3,89,5],[0,0,0,2],[2,0,2,16],[3,0,3,16],[8,8,8,15],[37,1,37,5],[21,11,21,15],[22,11,22,15],[23,11,23,15],[87,2,88,2],[88,3,88,5],[27,6,27,15],[37,6,37,15],[116,12,117,13],[118,12,119,13],[112,14,113,15],[110,14,111,15],[112,10,113,11],[114,14,115,15],[110,12,111,13],[112,12,113,13],[112,6,113,9],[116,6,117,9],[114,6,115,9],[188,8,188,11],[171,12,171,13],[169,2,169,5],[185,2,185,15],[169,12,169,13],[122,10,123,11],[120,12,121,13],[118,10,119,11],[169,7,169,8],[162,1,162,16],[166,10,167,11],[122,12,123,13],[120,14,121,15],[122,14,123,15],[166,12,167,13],[120,10,121,11],[124,12,125,13],[142,1,142,7],[132,1,132,3],[118,1,118,5],[127,1,127,5],[121,1,121,5],[168,7,168,8],[120,6,121,9],[194,6,194,7],[168,2,168,5],[169,10,169,11],[189,6,189,7],[170,12,170,13],[191,8,191,11],[184,2,184,15],[199,6,199,7],[230,6,230,12],[201,14,201,15],[199,14,199,15],[196,14,196,15],[194,12,194,13],[190,12,190,13],[194,8,194,11],[193,6,193,7],[171,2,171,5],[196,12,196,13],[197,8,197,11],[195,2,195,4],[189,8,189,11],[188,6,188,7],[193,12,193,13],[192,12,192,13],[233,13,234,15],[195,6,195,7],[198,12,198,13],[196,8,196,11],[198,14,198,15],[196,2,196,4],[201,12,201,13],[222,0,222,16],[197,2,197,4],[228,13,229,15],[197,12,197,13],[196,6,196,7],[199,12,199,13],[221,1,221,16],[197,6,197,7],[198,6,198,7],[197,14,197,15],[235,2,235,5],[235,6,235,12],[192,6,192,7],[189,2,189,4],[201,6,201,7],[233,6,234,12],[230,13,230,15],[195,14,195,15],[170,2,170,5],[235,13,235,15],[233,2,234,5],[190,8,190,11],[190,6,190,7],[191,6,191,7],[210,2,210,16],[195,8,195,11],[230,2,230,5],[228,2,229,5],[228,6,229,12],[192,8,192,11],[195,12,195,13],[194,14,194,15],[194,2,194,4],[193,14,193,15],[40,6,40,8],[41,13,41,15],[152,1,152,16],[81,3,81,6],[83,9,84,10],[139,1,139,3],[125,1,125,5],[86,3,86,5],[73,1,73,16],[69,10,69,15],[63,6,63,15],[65,4,65,10],[65,14,65,15],[120,1,120,5],[116,14,117,15],[83,6,84,8],[89,2,90,2],[118,14,119,15],[126,6,127,9],[126,14,127,15],[124,14,125,15],[119,1,119,5],[126,12,127,13],[118,6,119,9],[85,2,86,2],[88,14,88,15],[87,11,87,13],[83,2,84,2],[83,3,84,5],[85,9,85,10],[86,9,86,10],[87,9,87,10],[87,3,87,5],[85,6,85,8],[86,6,86,8],[86,14,86,15],[87,14,87,15],[191,12,191,13],[188,14,188,15],[188,12,188,13],[191,14,191,15],[190,14,190,15],[4,8,4,10],[4,12,4,14],[5,12,5,14],[5,8,5,10],[67,4,67,10],[21,3,21,7],[41,6,41,8],[40,13,40,15],[9,8,9,15],[24,1,24,5],[6,1,6,16],[16,5,16,15],[189,14,189,15],[19,9,19,15],[17,5,17,15],[29,13,29,15],[62,0,62,16],[71,3,71,7],[71,11,71,15],[187,6,187,7],[113,1,113,5],[90,6,90,8],[166,14,167,15],[168,10,168,11],[168,12,168,13],[169,14,169,15],[126,10,127,11],[166,7,167,8],[117,1,117,5],[115,1,115,5],[116,1,116,5],[112,1,112,5],[123,1,123,5],[167,2,167,4],[187,12,187,13],[164,2,164,16],[171,10,171,11],[126,1,126,5],[122,1,122,5],[130,0,130,16],[128,14,128,15],[116,10,117,11],[110,6,111,9],[240,2,241,3],[189,12,189,13],[188,2,188,4],[192,14,192,15],[190,2,190,4],[92,24,95,36],[171,14,171,15],[187,14,187,15],[87,6,87,8],[170,7,170,8],[170,14,170,15],[170,10,170,11],[89,9,89,10],[122,6,123,9],[171,7,171,8],[192,2,192,4],[191,2,191,4],[90,11,90,13],[124,6,125,9],[124,1,124,5],[124,10,125,11],[92,1,92,16],[90,3,90,5],[168,14,168,15]]}
[null,null,null,null,null,null,null,"Financing of Refundable R&D Tax Credits"]
[]
["LOAN / GUARANTEE APPLICATION"]
["General Information"]
[null,{"$f":"I9","v":0},null,null,null,null,null,null,"Nº. Organisation",null,null,null,"Nº. Dossier"]
[null,null,null,null,null,null,null,null,{"$f":"IF(RNumeroConfirmationDemande<>\"\",\"Nº. Demande\",\"\")","v":""},null,null,null,{"$f":"IF(RDateTransmissionDemande<>\"\",\"transmis le\",\"\")","v":""}]
["1.1 ","IDENTIFICATION"]
[]
[null,"Name of company submitting the application:"]
[null,"NEQ (Québec business number):"]
[]
[null,"Address of head office:"]
[]
[]
[]
[null,"Address of main office"]
[null,"(if different from head office):"]
[]
[]
[null,"Person Investissement Québec should contact:"]
[]
[null,"Title:",null,null,null,null,null,null,null,null,"Phone:"]
[null,null,null,null,null,null,null,null,null,null,"Fax:"]
[null,null,null,null,null,null,null,null,null,null,"E-mail:"]
[]
[null,"Address of contact person"]
[null,"(if different from head office):"]
[]
[]
[null,"Number of employees before the project:",null,null,null,null,null,null,null,null,null,null,"after the project:"]
{"$rows_left_out":212}
{"sheet":"Year 1 CALCULATIONS","index":2,"n_rows":200,"n_cols":23,"rows_kept":200,"cut":false,"hidden":false,"merged":[[181,2,181,7],[60,11,60,12],[133,2,133,8],[152,3,152,11],[151,3,151,11],[150,3,150,11],[180,2,180,10],[131,2,131,7],[129,2,129,7],[114,3,114,8],[113,3,113,8],[115,3,115,8],[127,2,127,8],[116,3,116,7],[10,11,10,12],[27,2,27,9],[8,2,10,7],[8,11,8,12],[9,11,9,12],[26,11,26,12],[25,11,25,12],[18,2,18,9],[23,2,23,9],[20,7,20,9],[21,3,21,9],[195,9,195,10],[195,11,195,14],[184,11,184,14],[185,11,185,14],[186,11,186,14],[193,9,193,10],[193,11,193,14],[190,2,190,9],[184,9,184,10],[185,9,185,10],[194,9,194,10],[194,11,194,14],[186,9,186,10],[7,11,7,12],[0,7,0,15],[0,1,0,5],[2,0,2,16],[3,0,3,16],[4,2,4,8],[58,11,58,12],[47,11,47,12],[18,11,18,12],[20,11,20,12],[21,11,21,12],[19,11,19,12],[29,11,29,12],[129,18,129,20],[78,13,78,14],[115,15,116,15],[27,11,27,12],[45,11,46,12],[54,11,54,12],[67,11,67,12],[28,11,28,12],[41,11,41,12],[44,11,44,12],[64,11,64,12],[57,11,57,12],[59,11,59,12],[42,11,43,12],[50,11,50,12],[48,11,48,12],[127,18,127,20],[61,11,61,12],[128,18,128,20],[115,9,116,9],[115,11,116,11],[122,15,123,15]]}
[null,null,null,null,null,null,null,"Financing of Refundable R&D Tax Credits"]
[]
["LOAN / GUARANTEE APPLICATION"]
["Calculations for tax credits to be financed (year 1)"]
[null,null,{"$f":"'General Information'!I9","v":0},null,null,null,null,null,null,null,{"$f":"'General Information'!I5","v":"Nº. Organisation"},{"$f":"'General Information'!L5","v":0},null,null,{"$f":"'General Information'!M5","v":"Nº. Dossier"},{"$f":"'General Information'!P5","v":0}]
[null,null,null,null,null,null,null,null,null,null,{"$f":"IF(RNumeroConfirmationDemande<>\"\",\"Nº. Demande\",\"\")","v":""},{"$f":"ANumeroConfirmationDemande","v":0},null,null,{"$f":"IF(RDateTransmissionDemande<>\"\",\"transmis le\",\"\")","v":""},{"$f":"ADateTransmissionDemande","v":"00:00:00"},null,null,null,null,"Rate applicable (Québec)  "]
[null,"ELIGIBILITY FOR REFUNDABLE R&D TAX CREDITS",null,null,null,null,null,null,null,null,null,null,null,null,null,null,null,{"$f":"IF(AND(MONTH(DATE(YEAR(RCalculDateDebut1),2,29)) =2,MONTH(RCalculDateDebut1)<3),TRUE,FALSE)","v":true},null,null,"for net eligible expenses not exceeding $2,000,000"]
[null,null,null,null,null,null,null,null,null,null,null,"(yyyy-mm-dd)",null,null,null,null,null,{"$f":"IF(AND(MONTH(DATE(YEAR(RCalculDateFin1),2,29)) =2,MONTH(RCalculDateFin1)>2),TRUE,FALSE)","v":false},null,null,"(based on assets as per financial statements)"]
[null,null,"First fiscal year to be financed\n(after December 4th, 2006)",null,null,null,null,null,null,"Commencement date:",null,null,null,{"$f":"\"   Be careful :\"","v":"   Be careful :"},null,null,null,{"$f":"RCalculDateFin1-RCalculDateDebut1","v":0},{"$f":"IF(OR(R7=TRUE,R8=TRUE),365,364)","v":365},null,"Net eligible expenses"]
[null,null,null,null,null,null,null,null,null,null,null,null,null,null,null,null,null,null,null,null,"(example)"]
[null,null,null,null,null,null,null,null,null,"Termination date:",null,null,null,{"$f":"\"   does not represent 12 months\"","v":"   does not represent 12 months"},null,null,null,null,null,null,null,1,0.375]
[null,null,null,null,null,null,null,null,null,null,null,null,null,null,null,null,null,null,null,null,null,25000000,0.375]
[null,"2.1","Eligibility for refundable R&D tax credits (Québec)",null,null,null,null,null,null,null,null,null,null,null,null,null,null,null,null,null,null,50000000,0.375]
[null,null,null,null,null,null,null,null,null,null,null,null,null,null,null,null,null,null,null,null,null,55000000,0.33500000000000002]
[null,null,null,null,null,null,null,null,null,"The company submitting the application is a Canadian corporation.",null,null,null,null,null,null,null,0,null,null,null,60000000,0.29499999999999998]
[null,null,null,null,null,null,null,null,null,null,null,null,null,null,null,null,null,null,null,null,null,65000000,0.255]
[null,null,null,null,null,null,null,null,null,null,null,null,null,null,null,null,null,null,null,null,null,70000000,0.215]
[null,null,null,null,null,null,null,null,null,null,null,null,null,null,null,null,null,null,null,null,null,75000000,0.17499999999999999]
[null,null,"Assets as per financial statements (year preceding the fiscal year):",null,null,null,null,null,null,null,"$",null,null,null,null,null,null,{"$f":"ROUND(0.375-((MAX(25000000,(MIN(50000000,L19)))-25000000)*0.2)/25000000,4)","v":0.17499999999999999}]
[]
[null,null,null,null,null,null,null,"As at:"]
[null,null,null,"If the company is a start-up, write down $1.",null,null,null,null,null,null,null,{"$f":"L8","v":"(yyyy-mm-dd)"}]
[]
[null,null,"Rate applicable for R&D tax credits on:"]
[null,null,null,null,null,null,null,null,null,null,null,null,null,null,null,null,null,{"$f":"RCalculDateFin1-DATE(2008,3,13)","v":-39520}]
[null,null,null,null,null,null,null,null,null,null,null,{"$f":"IF(R15=2,0.175,IF(OR(L19=\"\",L19=0),0,IF(AND(L19>0,R19>0,SaisiTerminer),R19,0)))","v":0},null," until December 04, 2006",null,null,null,{"$f":"IF(SaisiTerminer,IF(RCalculDateFin1>DATE(2008,3,13),IF(RCalculDateFin1>DATE(2009,3,13),3000000,ROUND(2000000+((RCalculDateFin1-DATE(2008,3,13))*(1000000/365)),0)),2000000),3000000)","v":3000000}]
[]
[null,null,{"$f":"\"Rate for net eligible expenses not exceeding  $\"&FIXED(R26,0)&\" :\"","v":"Rate for net eligible expenses not exceeding  $3 000 000 :"},null,null,null,null,null,null,null,null,{"$f":"IF(R15=2,0.175,IF(OR(L19=\"\",L19=0),0,IF(AND(L19>0,R30>0,SaisiTerminer),R30,0)))","v":0},null," after December 04, 2006"]
[]
[null,null,null,null,null,null,null,null,null,{"$f":"\"Rate for net eligible expenses exceeding $\"&FIXED(R26,0)&\" :\"","v":"Rate for net eligible expenses exceeding $3 000 000 :"},null,{"$f":"0.175","v":0.17499999999999999},null,null,null,null,null,{"$f":"ROUND(0.375-((MAX(50000000,(MIN(75000000,L19)))-50000000)*0.4)/50000000,4)","v":0.17499999999999999}]
{"$rows_left_out":171}
{"sheet":"Year 2 CALCULATIONS","index":3,"n_rows":200,"n_cols":23,"rows_kept":200,"cut":false,"hidden":false,"merged":[[129,18,129,20],[122,15,123,15],[78,13,78,14],[115,15,116,15],[127,18,127,20],[128,18,128,20],[27,2,27,9],[23,2,23,9],[20,7,20,9],[21,3,21,9],[45,11,46,12],[44,11,44,12],[29,11,29,12],[25,11,25,12],[27,11,27,12],[28,11,28,12],[26,11,26,12],[41,11,41,12],[42,11,43,12],[8,2,10,7],[8,11,8,12],[9,11,9,12],[20,11,20,12],[10,11,10,12],[18,2,18,9],[19,11,19,12],[18,11,18,12],[0,7,0,15],[0,1,0,5],[2,0,2,16],[3,0,3,16],[185,9,185,10],[7,11,7,12],[50,11,50,12],[21,11,21,12],[181,2,181,7],[115,3,115,8],[127,2,127,8],[152,3,152,11],[151,3,151,11],[150,3,150,11],[4,2,4,8],[47,11,47,12],[195,9,195,10],[195,11,195,14],[184,11,184,14],[185,11,185,14],[186,11,186,14],[194,9,194,10],[194,11,194,14],[186,9,186,10],[193,9,193,10],[193,11,193,14],[190,2,190,9],[184,9,184,10],[48,11,48,12],[54,11,54,12],[67,11,67,12],[61,11,61,12],[64,11,64,12],[57,11,57,12],[59,11,59,12],[60,11,60,12],[58,11,58,12],[180,2,180,10],[113,3,113,8],[115,11,116,11],[133,2,133,8],[114,3,114,8],[115,9,116,9],[129,2,129,7],[131,2,131,7],[116,3,116,7]]}
[null,null,null,null,null,null,null,"Financing of Refundable R&D Tax Credits"]
[]
["LOAN / GUARANTEE APPLICATION"]
["Calculations for tax credits to be financed (year 2)"]
[null,null,{"$f":"'General Information'!I9","v":0},null,null,null,null,null,null,null,{"$f":"'General Information'!I5","v":"Nº. Organisation"},{"$f":"'General Information'!L5","v":0},null,null,{"$f":"'General Information'!M5","v":"Nº. Dossier"},{"$f":"'General Information'!P5","v":0}]
[null,null,null,null,null,null,null,null,null,null,{"$f":"IF(RNumeroConfirmationDemande<>\"\",\"Nº. Demande\",\"\")","v":""},{"$f":"ANumeroConfirmationDemande","v":0},null,null,{"$f":"IF(RDateTransmissionDemande<>\"\",\"transmis le\",\"\")","v":""},{"$f":"ADateTransmissionDemande","v":"00:00:00"},null,null,null,null,"Rate applicable (Québec)  "]
[null,"ELIGIBILITY FOR REFUNDABLE R&D TAX CREDITS",null,null,null,null,null,null,null,null,null,null,null,null,null,null,null,{"$f":"IF(AND(MONTH(DATE(YEAR(RCalculDateDebut2),2,29)) =2,MONTH(RCalculDateDebut2)<3),TRUE,FALSE)","v":true},null,null,"for net eligible expenses not exceeding $2,000,000"]
[null,null,null,null,null,null,null,null,null,null,null,"(yyyy-mm-dd)",null,null,null,null,null,{"$f":"IF(AND(MONTH(DATE(YEAR(RCalculDateFin2),2,29)) =2,MONTH(RCalculDateFin2)>2),TRUE,FALSE)","v":false},null,null,"(based on assets as per financial statements)"]
[null,null,"Second fiscal year to be financed\n(after December 4th, 2006)",null,null,null,null,null,null,"Commencement date:",null,null,null,{"$f":"\"   Be careful :\"","v":"   Be careful :"},null,null,null,{"$f":"RCalculDateFin2-RCalculDateDebut2","v":0},{"$f":"IF(OR(R7=TRUE,R8=TRUE),365,364)","v":365},null,"Net eligible expenses"]
[null,null,null,null,null,null,null,null,null,null,null,null,null,null,null,null,null,null,null,null,"(example)"]
[null,null,null,null,null,null,null,null,null,"Termination date:",null,null,null,{"$f":"\"   does not represent 12 months\"","v":"   does not represent 12 months"},null,null,null,null,null,null,null,1,0.375]
[null,null,null,null,null,null,null,null,null,null,null,null,null,null,null,null,null,null,null,null,null,25000000,0.375]
[null,"2.1","Eligibility for refundable R&D tax credits (Québec)",null,null,null,null,null,null,null,null,null,null,null,null,null,null,null,null,null,null,50000000,0.375]
[null,null,null,null,null,null,null,null,null,null,null,null,null,null,null,null,null,null,null,null,null,55000000,0.33500000000000002]
[null,null,null,null,null,null,null,null,null,"The company submitting the application is a Canadian corporation.",null,null,null,null,null,null,null,0,null,null,null,60000000,0.29499999999999998]
[null,null,null,null,null,null,null,null,null,null,null,null,null,null,null,null,null,null,null,null,null,65000000,0.255]
[null,null,null,null,null,null,null,null,null,null,null,null,null,null,null,null,null,null,null,null,null,70000000,0.215]
[null,null,null,null,null,null,null,null,null,null,null,null,null,null,null,null,null,null,null,null,null,75000000,0.17499999999999999]
[null,null,"Assets as per financial statements (year preceding the fiscal year):",null,null,null,null,null,null,null,"$",null,null,null,null,null,null,{"$f":"ROUND(0.375-((MAX(25000000,(MIN(50000000,L19)))-25000000)*0.2)/25000000,4)","v":0.17499999999999999}]
[]
[null,null,null,null,null,null,null,"As at:"]
[null,null,null,"If the company is a start-up, write down $1.",null,null,null,null,null,null,null,{"$f":"L8","v":"(yyyy-mm-dd)"}]
[]
[null,null,"Rate applicable for R&D tax credits on:"]
[null,null,null,null,null,null,null,null,null,null,null,null,null,null,null,null,null,{"$f":"RCalculDateFin1-DATE(2008,3,13)","v":-39520}]
[null,null,null,null,null,null,null,null,null,null,null,{"$f":"IF(R15=2,0.175,IF(OR(L19=\"\",L19=0),0,IF(AND(L19>0,R19>0,SaisiTerminer),R19,0)))","v":0},null," until December 04, 2006",null,null,null,{"$f":"IF(SaisiTerminer,IF(RCalculDateFin1>DATE(2008,3,13),IF(RCalculDateFin1>DATE(2009,3,13),3000000,ROUND(2000000+((RCalculDateFin1-DATE(2008,3,13))*(1000000/365)),0)),2000000),3000000)","v":3000000}]
[]
[null,null,{"$f":"\"Rate for net eligible expenses not exceeding  $\"&FIXED(R26,0)&\" :\"","v":"Rate for net eligible expenses not exceeding  $3 000 000 :"},null,null,null,null,null,null,null,null,{"$f":"IF(R15=2,0.175,IF(OR(L19=\"\",L19=0),0,IF(AND(L19>0,R30>0,SaisiTerminer),R30,0)))","v":0},null," after December 04, 2006"]
[]
[null,null,null,null,null,null,null,null,null,{"$f":"\"Rate for net eligible expenses exceeding $\"&FIXED(R26,0)&\" :\"","v":"Rate for net eligible expenses exceeding $3 000 000 :"},null,{"$f":"0.175","v":0.17499999999999999},null,null,null,null,null,{"$f":"ROUND(0.375-((MAX(50000000,(MIN(75000000,L19)))-50000000)*0.4)/50000000,4)","v":0.17499999999999999}]
{"$rows_left_out":171}
{"sheet":"Financing","index":4,"n_rows":51,"n_cols":26,"rows_kept":51,"cut":false,"hidden":false,"merged":[[41,4,41,5],[41,7,41,11],[24,12,24,14],[25,12,25,14],[24,1,24,8],[29,1,29,8],[30,1,30,8],[37,1,37,8],[34,1,34,8],[33,1,33,8],[31,1,31,8],[32,1,32,8],[35,1,35,8],[0,1,0,5],[0,7,0,15],[2,0,2,16],[3,0,3,16],[19,1,19,15],[4,2,4,8]]}
[null,null,null,null,null,null,null,"Financing of Refundable R&D Tax Credits"]
[]
["LOAN / GUARANTEE APPLICATION"]
["Calculations related to tax credits"]
[null,null,{"$f":"'General Information'!I9","v":0},null,null,null,null,null,null,null,{"$f":"'General Information'!I5","v":"Nº. Organisation"},{"$f":"'General Information'!L5","v":0},null,null,{"$f":"'General Information'!M5","v":"Nº. Dossier"},{"$f":"'General Information'!P5","v":0}]
[null,null,null,null,null,null,null,null,null,null,{"$f":"IF(RNumeroConfirmationDemande<>\"\",\"Nº. Demande\",\"\")","v":""},{"$f":"ANumeroConfirmationDemande","v":0},null,null,{"$f":"IF(RDateTransmissionDemande<>\"\",\"transmis le\",\"\")","v":""},{"$f":"ADateTransmissionDemande","v":"00:00:00"}]
[null,"4.  MAXIMUM LOAN (in $)"]
[]
[]
[null,null,null,null,null,null,null,null,"Fiscal year ended:",{"$f":"IF('Year 1 CALCULATIONS'!P80=0,\"\",'Year 1 CALCULATIONS'!P80)","v":""},null,{"$f":"IF('Year 2 CALCULATIONS'!P80=0,\"\",'Year 2 CALCULATIONS'!P80)","v":""},null,null,null,"Total"]
[null,"Refundable tax credits (Québec) to be financed",null,null,null,null,null,null,null,{"$f":"IF('Year 1 CALCULATIONS'!P134=0,\"\",'Year 1 CALCULATIONS'!P134)","v":""},null,{"$f":"IF('Year 2 CALCULATIONS'!P134=0,\"\",'Year 2 CALCULATIONS'!P134)","v":""},null,null,null,{"$f":"SUM(J11:L11)","v":0}]
[null,"Refundable tax credits (Canada) to be financed",null,null,null,null,null,null,null,{"$f":"IF('Year 1 CALCULATIONS'!P200=0,\"\",'Year 1 CALCULATIONS'!P200)","v":""},null,{"$f":"IF('Year 2 CALCULATIONS'!P200=0,\"\",'Year 2 CALCULATIONS'!P200)","v":""},null,null,null,{"$f":"SUM(J12:L12)","v":0}]
[null,"Total credits for the year",null,null,null,null,null,null,null,{"$f":"IF(ISERROR(J11+J12),\"\",J11+J12)","v":""},null,{"$f":"IF(ISERROR(L11+L12),\"\",L11+L12)","v":""},null,null,null,{"$f":"SUM(J13:L13)","v":0}]
[null,"Maximum loan at 75%",null,null,null,null,null,null,null,{"$f":"IF(ISERROR(J13*0.75),\"\",ROUND(J13*0.75,0))","v":""},null,{"$f":"IF(ISERROR(L13*0.75),\"\",ROUND(L13*0.75,0))","v":""},null,null,null,{"$f":"IF(SUM(J14:L14)=0,\"\",SUM(J14:L14))","v":""}]
[null,null,"Montant financé par le dossier précédent",null,null,null,null,null,null,null,null,null,null,null,null,{"$f":"SUM(J15:L15)","v":0}]
[null,null,"Montant à financer par ce nouveau dossier",null,null,null,null,null,null,{"$f":"IF(ISERROR(J14-J15),\"\",J14-J15)","v":""},null,{"$f":"IF(ISERROR(L14-L15),\"\",L14-L15)","v":""},null,null,null,{"$f":"SUM(J16:L16)","v":0}]
[null,"Portion financée (en %)",null,null,null,null,null,null,null,{"$f":"IF(ISERROR(IF((J13)>0,(J18/J13),0)),\"\",IF((J13)>0,(J18/J13),0))","v":""},null,{"$f":"IF(ISERROR(IF((L13)>0,(L18/L13),0)),\"\",IF((L13)>0,(L18/L13),0))","v":""},null,null,null,{"$f":"IF(ISERROR(IF((P13)>0,(P18/P13),0)),\"\",IF((P13)>0,(P18/P13),0))","v":0}]
[null,"Crédits financés (année courante, arrondis)",null,null,null,null,null,null,null,null,null,null,null,null,null,{"$f":"SUM(J18:L18)","v":0}]
[null,"1er certificat de garantie annuel :",null,null,null,0.8,null,null,null,{"$f":"IF(J18*F19=0,\"\",J18*F19)","v":""},null,{"$f":"IF(L18*F19=0,\"\",L18*F19)","v":""}]
[null,"The total loan amount must exceed $62,500"]
[]
[]
[null,"5. FINANCEMENT (en $)"]
[]
[null,"Exercice financier terminé le : ",null,null,null,null,null,null,null,{"$f":"IF('Year 1 CALCULATIONS'!P80=0,\"\",'Year 1 CALCULATIONS'!P80)","v":""},null,{"$f":"IF('Year 2 CALCULATIONS'!P80=0,\"\",'Year 2 CALCULATIONS'!P80)","v":""},null,null,null,"Total"]
[null,"Total des dépenses (report des feuilles Calculs.)",null,null,null,null,null,null,null,{"$f":"'Year 1 CALCULATIONS'!P96","v":0},null,{"$f":"'Year 2 CALCULATIONS'!P96","v":0},null,null,null,{"$f":"SUM(J26,L26)","v":0}]
[]
[]
[null,null,null,null,null,null,null,null,"Exercice terminé le :",{"$f":"J10","v":""},null,{"$f":"L10","v":""},null,null,null,"Total"]
[null,"Actions ord. - Promoteurs (mise de fonds)",null,null,null,null,null,null,null,null,null,null,null,null,null,{"$f":"SUM(J30,L30)","v":0}]
{"$rows_left_out":21}