{"text_format":"1","workbook":"xlsx","n_sheets":6,"sheets":["Instructions","General Information","Year 1 CALCULATIONS","Year 2 CALCULATIONS","Financing","Calculs"],"not_rendered":{"charts":0,"images":14,"macros":1,"external_links":0,"defined_names":38,"comments":4,"pivot_tables":0},"unopened":[],"bounds":{"document_bytes":16777216,"sheet_cells":100000,"rows_first":2000,"rows_last":500,"rows_between":2000,"halvings":0,"cell_chars":16384,"cell_head_chars":4096},"cells_cut":0,"cells_raw":0,"read":"whole","date_system":"1900"}

{"sheet":"Instructions","index":0,"n_rows":157,"n_cols":4,"rows_kept":157,"cut":false,"hidden":false,"merged":[[99,1,99,2],[2,1,2,2],[3,1,3,2],[77,0,77,3],[86,1,86,2],[92,1,92,2]]}
[]
[null,null,null,"Financing of Working Capital for Export Projects - knowledge-based economy"]
[null,"LOAN / GUARANTEE APPLICATION"]
[null,"Instructions"]
[]
[]
[]
[]
[]
[]
[]
[]
[]
[]
[]
[]
[]
[]
[]
[]
{"$rows_left_out":138}
{"sheet":"General Information","index":1,"n_rows":333,"n_cols":23,"rows_kept":333,"cut":false,"hidden":false,"merged":[[270,12,271,14],[258,12,258,14],[258,1,258,4],[220,1,220,5],[75,10,75,15],[68,1,68,16],[52,6,52,8],[73,4,73,10],[333,5,333,9],[218,1,218,3],[307,0,307,16],[260,1,260,4],[260,6,260,7],[260,12,260,14],[260,8,260,11],[263,8,263,11],[305,1,305,16],[332,1,333,3],[253,8,253,11],[258,8,258,11],[255,8,255,11],[321,6,321,12],[270,15,271,15],[270,8,271,11],[273,12,273,14],[72,14,72,15],[28,5,28,15],[29,5,29,15],[265,8,265,11],[264,8,264,11],[160,6,161,9],[155,1,155,5],[157,1,157,5],[150,6,151,9],[158,14,159,15],[152,10,153,11],[152,12,153,13],[154,10,155,11],[150,14,151,15],[152,14,153,15],[161,1,161,5],[248,8,248,11],[244,1,244,15],[248,6,248,7],[263,1,263,4],[261,1,261,4],[257,1,257,4],[259,1,259,4],[81,1,81,15],[181,1,181,7],[144,1,144,5],[145,1,145,5],[159,1,159,5],[158,1,158,5],[151,1,151,5],[77,4,77,8],[77,12,77,15],[160,12,161,13],[160,10,161,11],[158,10,159,11],[146,10,147,11],[156,14,157,15],[153,1,153,5],[141,14,141,15],[113,6,113,8],[103,1,103,16],[109,11,110,14],[112,3,112,5],[113,3,113,5],[107,5,107,15],[95,2,95,14],[255,1,255,4],[219,1,219,5],[255,6,255,7],[148,12,149,13],[148,14,149,15],[144,14,145,15],[220,14,220,15],[219,14,219,15],[220,12,220,13],[154,14,155,15],[217,14,218,15],[144,12,145,13],[146,14,147,15],[148,1,148,5],[146,6,147,9],[168,1,168,3],[144,10,145,11],[146,1,146,5],[156,1,156,5],[255,12,255,14],[254,1,254,4],[253,1,253,4],[256,12,256,14],[217,10,218,11],[219,12,219,13],[217,12,218,13],[156,6,157,9],[158,6,159,9],[158,12,159,13],[156,12,157,13],[219,10,219,11],[217,7,218,8],[165,0,165,16],[249,8,249,11],[247,6,247,7],[220,7,220,8],[221,7,221,8],[246,1,246,4],[246,8,246,11],[219,7,219,8],[222,7,222,8],[222,10,222,11],[215,1,215,16],[248,12,248,14],[249,12,249,14],[160,1,160,5],[0,0,0,2],[2,0,2,16],[3,0,3,16],[27,5,27,15],[24,5,24,15],[25,5,25,15],[13,11,13,13],[23,5,23,15],[15,11,15,13],[4,1,4,7],[13,4,13,5],[14,4,14,5],[20,7,20,15],[21,7,21,15],[18,1,18,16],[11,10,11,14],[4,11,4,12],[7,1,7,5],[9,2,9,14],[14,11,14,13],[15,6,15,8],[13,6,13,8],[14,6,14,8],[30,1,30,5],[32,1,32,5],[156,10,157,11],[178,1,178,3],[160,14,161,15],[148,10,149,11],[148,6,149,9],[154,6,155,9],[152,1,152,5],[142,1,142,5],[141,1,141,5],[152,6,153,9],[150,12,151,13],[112,1,112,2],[142,14,143,15],[142,12,143,13],[154,12,155,13],[162,14,162,15],[142,6,143,9],[92,2,93,14],[113,11,113,14],[111,6,111,8],[98,2,98,14],[72,11,72,13],[36,1,36,5],[31,9,31,15],[41,6,41,8],[39,6,39,15],[49,1,49,5],[38,6,38,15],[52,13,52,15],[70,6,70,15],[33,11,33,15],[34,11,34,15],[33,3,33,7],[35,11,35,15],[37,6,37,15],[41,13,41,15],[53,13,53,15],[53,6,53,8],[45,1,45,16],[49,6,49,15],[67,1,67,16],[72,4,72,10],[54,0,54,16],[250,1,250,4],[246,6,246,7],[221,10,221,11],[221,1,221,5],[222,1,222,5],[243,1,243,15],[247,8,247,11],[221,14,221,15],[221,12,221,13],[247,12,247,14],[246,12,246,14],[222,12,222,13],[249,6,249,7],[222,14,222,15],[220,10,220,11],[147,1,147,5],[154,1,154,5],[248,1,248,4],[247,1,247,4],[249,1,249,4],[150,10,151,11],[149,1,149,5],[102,1,102,15],[109,1,110,2],[109,3,110,5],[109,6,110,8],[113,1,113,2],[109,9,110,10],[111,9,111,10],[112,9,112,10],[109,15,110,15],[113,9,113,10],[112,6,112,8],[143,1,143,5],[144,6,145,9],[268,8,268,11],[319,1,320,5],[94,2,94,14],[111,1,111,2],[261,6,261,7],[96,2,96,14],[111,11,111,14],[112,11,112,14],[142,10,143,11],[257,12,257,14],[263,12,263,14],[259,12,259,14],[262,12,262,14],[261,12,261,14],[213,1,213,16],[195,1,195,16],[141,6,141,9],[139,1,139,16],[111,3,111,5],[150,1,150,5],[141,10,141,11],[97,2,97,14],[141,12,141,13],[273,1,273,4],[269,8,269,11],[268,12,268,14],[118,1,118,16],[146,12,147,13],[334,5,334,9],[324,1,325,5],[324,6,325,12],[267,12,267,14],[326,1,326,5],[326,6,326,12],[326,13,326,15],[270,1,271,4],[268,1,268,4],[269,6,269,7],[267,1,267,4],[267,8,267,11],[267,6,267,7],[268,6,268,7],[319,6,320,12],[321,1,321,5],[270,6,271,7],[270,5,271,5],[287,1,287,15],[252,12,252,14],[332,5,332,9],[253,6,253,7],[253,12,253,14],[256,6,256,7],[256,8,256,11],[254,12,254,14],[254,6,254,7],[257,6,257,7],[257,8,257,11],[252,6,252,7],[252,8,252,11],[254,8,254,11],[264,6,264,7],[265,6,265,7],[258,6,258,7],[259,6,259,7],[319,13,320,15],[321,13,321,15],[324,13,325,15],[266,8,266,11],[265,12,265,14],[256,1,256,4],[273,6,273,7],[118,22,121,33],[250,12,250,14],[269,12,269,14],[261,8,261,11],[262,8,262,11],[250,6,250,7],[250,8,250,11],[264,1,264,4],[265,1,265,4],[266,1,266,4],[251,1,251,4],[252,1,252,4],[262,1,262,4],[269,1,269,4],[251,12,251,14],[251,6,251,7],[251,8,251,11],[263,6,263,7],[266,6,266,7],[264,12,264,14],[259,8,259,11],[262,6,262,7],[266,12,266,14]]}
[null,null,null,null,null,null,null,null,null,null,null,null,null,null,null,"Financing of Working Capital for Export Projects - knowledge-based economy"]
[null,null,null,null,null,null,null,null,null,null,null,null,null,null,null,{"$f":"I21","v":0}]
["LOAN / GUARANTEE APPLICATION"]
["General Information",null,null,null,null,null,null,null,null,null,null,null,null,null,null,null,null,null,null,null,null,null,"++++++++++     Click here to choose the tax credit.     ++++++++++"]
[null,{"$f":"H21","v":0},null,null,null,null,null,null,null,"Organisation No.: ",null,null,null,null,"File No.: ",null,null,null,null,null,null,null,"Biotechnology development centres (CDB) – Expires 31-12-2013"]
[null,null,null,null,null,null,null,null,null,null,null,null,null,null,null,null,null,null,null,null,null,null,"Major employment-generating projects (GPCE) – Expires 31-12-2016"]
[null,null,null,null,null,null,null,null,null,null,null,null,null,null,null,null,null,null,null,null,null,null,"Production of multimedia titles (PTM) – Permanent tax measure"]
[null,"CHOICE OF TAX CREDIT TO BE FINANCED",null,null,null,null,null,null,null,null,null,null,null,null,null,null,null,null,null,null,null,null,"Technology adaptation services (SAT) – Permanent tax measure"]
[null,null,null,null,null,null,null,null,null,null,null,null,null,null,null,null,null,null,null,null,null,null,"New economy centres (CNE) – Expires 31-12-2013"]
[null,null,"++++++++++     Click here to choose the tax credit.     ++++++++++",null,null,null,null,null,null,null,null,null,null,null,null,null,null,null,null,null,null,null,"Centre national des nouvelles technologies de Québec (CNNTQ) – Expires 31-12-2013"]
[null,null,null,null,null,null,null,null,null,null,null,null,null,null,null,null,null,null,null,null,null,null,"Information technology development centres (CDTI) - Expires 31-12-2013"]
[null,null,"Fiscal year to be financed:",null,null,null,null,"1st fiscal year",null,null,"2nd fiscal year (if need be)",null,null,null,null,null,null,null,null,null,null,null,"E-Commerce Place (CCE) – Expires 31-12-2013"]
[null,null,null,null,null,null,null,null,null,null,null,null,null,null,null,null,null,null,null,null,null,null,"Cité Multimédia de Montréal (CMM) – Expires 31-12-2013"]
[null,null,null,null,"Start date:",null,null,null,null,null,null,null,null,null,null,null,null,null,null,null,null,null,"Development of e-business (CDAE) – Expires 31-12-2025"]
[null,null,null,null,"End date:"]
[null,null,null,null,null,null,"(yyyy-mm-dd)",null,null,null,null,"(yyyy-mm-dd)",null,null,null,null,null,null,null,null,null,null,{"$f":"C10","v":"++++++++++     Click here to choose the tax credit.     ++++++++++"}]
[]
[]
["1.","IDENTIFICATION"]
[]
{"$rows_left_out":314}
{"sheet":"Year 1 CALCULATIONS","index":2,"n_rows":65,"n_cols":39,"rows_kept":65,"cut":false,"hidden":false,"merged":[[15,1,15,6],[0,0,0,2],[9,2,9,6],[13,2,13,6],[3,0,3,7],[4,0,4,7],[5,1,5,2],[382,12,383,12],[444,9,444,11],[445,9,445,11],[446,9,446,11],[17,9,17,14],[43,9,43,14],[130,12,131,12],[203,9,203,11],[202,9,202,11],[201,9,201,11],[194,9,194,11],[193,9,193,11],[192,9,192,11],[40,1,40,2],[31,1,31,2],[17,1,17,6],[18,1,18,2],[32,1,32,2],[32,4,32,5],[33,1,33,2],[41,1,41,6],[453,9,453,11],[46,1,46,2],[44,1,45,1],[44,2,45,2],[43,1,43,6],[44,4,45,4],[42,1,42,6],[454,9,454,11],[455,9,455,11],[44,3,45,3],[44,5,45,5],[44,6,45,6]]}
[]
[null,null,null,null,null,null,"Financing of Working Capital for Export Projects - knowledge-based economy",null,null,null,null,null,null,null,null,{"$f":"I21","v":0}]
[]
["LOAN / GUARANTEE APPLICATION"]
["Calculations for tax credits to be financed"]
[null,{"$f":"'General Information'!H21","v":0},null,null,{"$f":"'General Information'!J5&'General Information'!L5","v":"Organisation No.: "},null,{"$f":"'General Information'!O5&'General Information'!P5","v":"File No.: "}]
[]
["1.","ESTIMATE OF TAX CREDITS TO BE FINANCED"]
[]
[null,"Tax credit :",{"$f":"IF('General Information'!W16=\"++++++++++     Click here to choose the tax credit.     ++++++++++\",\"No tax credit selected\",'General Information'!W16)","v":"No tax credit selected"}]
[]
[]
[null,"Location where activities "]
[null,"will be carried out:"]
[]
[null,"Note: The table in section 2 below can be used to establish costs relating to salaries."]
[]
[null,{"$f":"IF(C10=M28,\"First fiscal year to be financed\",CONCATENATE(\"First fiscal year to be financed \",IF(AND('General Information'!G14<>0,'General Information'!G15<>0),(CONCATENATE(\"(from \",YEAR('General Information'!G14),\"-\",IF(MONTH('General Information'!G14)<10,CONCATENATE(\"0\",MONTH('General Information'!G14)),MONTH('General Information'!G14)),\"-\",IF(DAY('General Information'!G14)<10,CONCATENATE(\"0\",DAY('General Information'!G14)),DAY('General Information'!G14)),\" to \",YEAR('General Information'!G15),\"-\",IF(MONTH('General Information'!G15)<10,CONCATENATE(\"0\",MONTH('General Information'!G15)),MONTH('General Information'!G15)),\"-\",IF(DAY('General Information'!G15)<10,CONCATENATE(\"0\",DAY('General Information'!G15)),DAY('General Information'!G15)),\")\")),\"(from ______________ to _____________ )\")))","v":"First fiscal year to be financed (from ______________ to _____________ )"}]
[null,{"$f":"VLOOKUP($C$10,$M$19:$AL$29,2,FALSE)","v":"No tax credit selected"},null,"Total costs ($)","Eligible costs ($)","Applicable tax credit % ","Tax credits to be financed (Québec) ($)",null,null,null,null,null,"No tax credit selected","No tax credit selected"]
[null,{"$f":"VLOOKUP($C$10,$M$19:$AL$29,3,FALSE)","v":0},null,null,null,{"$f":"VLOOKUP($C$10,M$19:AL$29,4,FALSE)","v":0},{"$f":"IF((D20)>=E20,(E20*F20),0)","v":0},null,null,null,null,null,"Biotechnology development centres (CDB) – Expires 31-12-2013","CBD","Eligible salaries",0.3,"Equipment acquired or leased",0.3,"less: non-refundable financial contribution(s)",-0.3,null,null,null,null,null,null,null,null,null,null,null,null,null,null,null,null,null,null,"37 500 $"]
{"$rows_left_out":46}
{"sheet":"Year 2 CALCULATIONS","index":3,"n_rows":65,"n_cols":41,"rows_kept":65,"cut":false,"hidden":false,"merged":[[17,9,17,14],[31,1,31,2],[17,1,17,6],[18,1,18,2],[15,1,15,6],[40,1,40,2],[43,1,43,6],[32,1,32,2],[32,4,32,5],[0,0,0,2],[9,2,9,6],[13,2,13,6],[3,0,3,7],[4,0,4,7],[5,1,5,2],[33,1,33,2],[382,12,383,12],[192,9,192,11],[455,9,455,11],[46,1,46,2],[130,12,131,12],[194,9,194,11],[203,9,203,11],[444,9,444,11],[445,9,445,11],[453,9,453,11],[454,9,454,11],[446,9,446,11],[202,9,202,11],[201,9,201,11],[193,9,193,11],[43,9,43,14],[41,1,41,6],[44,4,45,4],[44,1,45,1],[44,2,45,2],[44,3,45,3],[42,1,42,6],[44,5,45,5],[44,6,45,6]]}
[]
[null,null,null,null,null,null,"Financing of Working Capital for Export Projects - knowledge-based economy",null,null,null,null,null,null,null,null,{"$f":"I21","v":0}]
[]
["LOAN / GUARANTEE APPLICATION"]
["Calculations for tax credits to be financed (year 2)"]
[null,{"$f":"'General Information'!H21","v":0},null,null,{"$f":"'General Information'!J5&'General Information'!L5","v":"Organisation No.: "},null,{"$f":"'General Information'!O5&'General Information'!P5","v":"File No.: "}]
[]
["1.","ESTIMATE OF TAX CREDITS TO BE FINANCED"]
[]
[null,"Tax credit:",{"$f":"IF('General Information'!W16=\"++++++++++     Click here to choose the tax credit.     ++++++++++\",\"No tax credit selected\",'General Information'!W16)","v":"No tax credit selected"}]
[]
[]
[null,"Location where activities"]
[null,"will be carried out:"]
[]
[null,"Note: The table in section 2 below can be used to establish costs relating to salaries."]
[]
[null,{"$f":"IF(C10=M28,\"Second fiscal year to be financed\",CONCATENATE(\"Second fiscal year to be financed \",IF(AND('General Information'!L14<>0,'General Information'!L15<>0),(CONCATENATE(\"(from \",YEAR('General Information'!L14),\"-\",IF(MONTH('General Information'!L14)<10,CONCATENATE(\"0\",MONTH('General Information'!L14)),MONTH('General Information'!L14)),\"-\",IF(DAY('General Information'!L14)<10,CONCATENATE(\"0\",DAY('General Information'!L14)),DAY('General Information'!L14)),\" to \",YEAR('General Information'!L15),\"-\",IF(MONTH('General Information'!L15)<10,CONCATENATE(\"0\",MONTH('General Information'!L15)),MONTH('General Information'!L15)),\"-\",IF(DAY('General Information'!L15)<10,CONCATENATE(\"0\",DAY('General Information'!L15)),DAY('General Information'!L15)),\")\")),\"(from ______________ to _____________ )\")))","v":"Second fiscal year to be financed (from ______________ to _____________ )"}]
[null,{"$f":"VLOOKUP($C$10,$M$19:$AL$29,2,FALSE)","v":"No tax credit selected"},null,"Total costs ($)","Eligible costs ($)","Applicable tax credit % ","Tax credits to be financed (Québec) ($)",null,null,null,null,null,"No tax credit selected","No tax credit selected"]
[null,{"$f":"VLOOKUP($C$10,$M$19:$AL$29,3,FALSE)","v":0},null,null,null,{"$f":"VLOOKUP($C$10,M$19:AL$29,4,FALSE)","v":0},{"$f":"IF((D20)>=E20,(E20*F20),0)","v":0},null,null,null,null,null,"Biotechnology development centres (CDB) – Expires 31-12-2013","CBD","Eligible salaries",0.3,"Equipment acquired or leased",0.3,"less: non-refundable financial contribution(s)",-0.3,null,null,null,null,null,null,null,null,null,null,null,null,null,null,null,null,null,null,"37 500 $"]
{"$rows_left_out":46}
{"sheet":"Financing","index":4,"n_rows":55,"n_cols":16,"rows_kept":55,"cut":false,"hidden":false,"merged":[[19,7,19,9],[20,1,20,13],[18,14,18,15],[19,14,19,15],[33,2,33,10],[26,14,26,15],[27,14,27,15],[30,14,30,15],[31,14,31,15],[32,14,32,15],[32,12,32,13],[30,12,30,13],[27,12,27,13],[17,14,17,15],[15,12,15,13],[16,12,16,13],[34,14,34,15],[13,14,13,15],[13,12,13,13],[17,12,17,13],[14,14,14,15],[14,12,14,13],[15,14,15,15],[16,14,16,15],[12,14,12,15],[0,1,0,5],[4,0,4,16],[5,0,5,16],[1,8,1,15],[6,2,6,11],[6,12,6,14],[12,1,12,10],[11,11,11,13],[12,12,12,13],[17,1,17,10],[18,1,18,10],[19,1,19,6],[39,2,39,10],[38,2,38,10],[27,2,27,10],[32,2,32,10],[25,10,25,13],[31,12,31,13],[26,2,26,10],[30,2,30,10],[31,2,31,10],[26,12,26,13],[18,12,18,13],[19,12,19,13],[34,12,34,13],[13,1,13,10],[14,1,14,10],[33,14,33,15],[38,12,38,13],[35,12,35,13],[34,2,34,10],[37,2,37,10],[36,2,36,10],[36,12,36,13],[37,12,37,13],[38,14,38,15],[33,12,33,13],[37,14,37,15],[36,14,36,15],[35,2,35,10],[35,14,35,15]]}
[]
[null,null,null,null,null,null,null,null,"Financing of Working Capital for Export Projects - knowledge-based economy"]
[]
[]
["LOAN / GUARANTEE APPLICATION"]
["Calculations for tax credits to be financed"]
[null,null,{"$f":"'General Information'!H21","v":0},null,null,null,null,null,null,null,null,null,{"$f":"'General Information'!J5 & 'General Information'!L5","v":"Organisation No.: "},null,null,{"$f":"'General Information'!O5&'General Information'!P5","v":"File No.: "}]
[]
[]
[null,"3. MAXIMUM LOAN ($)"]
[]
[]
[null,"Fiscal year(s) ended: ",null,null,null,null,null,null,null,null,null,{"$f":"IF('General Information'!G15=\"\",\"\",'General Information'!G15)","v":""},{"$f":"IF('General Information'!L15=\"\",\"\",'General Information'!L15)","v":""},null,"Total"]
[null,"Refundable tax credits (Québec) to be financed",null,null,null,null,null,null,null,null,null,{"$f":"'Year 1 CALCULATIONS'!G34","v":0},{"$f":"'Year 2 CALCULATIONS'!G34","v":0},null,{"$f":"SUM(L14+M14)","v":0}]
[null,"Maximum loan at 85%",null,null,null,null,null,null,null,null,null,{"$f":"IF(ISERROR(L14*85%),\"\",L14*85%)","v":0},{"$f":"IF(ISERROR(M14*85%),\"\",M14*85%)","v":0},null,{"$f":"IF(ISERROR(SUM(L15:N15)),\"\",SUM(L15:N15))","v":0}]
[null,"Montant financé par le dossier précédent",null,null,null,null,null,null,null,"no.",null,null,null,null,{"$f":"SUM(L16:N16)","v":0}]
[null,"Montant à financer par ce nouveau dossier",null,null,null,null,null,null,null,"no.",null,{"$f":"IF(ISERROR(L15-L16),\" \",L15-L16)","v":0},{"$f":"IF(ISERROR(M15-M16),\"\",M15-M16)","v":0},null,{"$f":"SUM(L17:N17)","v":0}]
[null,"Portion financée (en %)",null,null,null,null,null,null,null,null,null,{"$f":"IF((L14)>0,(L19/L14),0)","v":0},{"$f":"IF((M14)>0,(M19/M14),0)","v":0},null,{"$f":"IF((O14)>0,(O19/O14),0)","v":0}]
[null,"Crédits financés (année courante, arrondis)",null,null,null,null,null,null,null,null,null,null,null,null,{"$f":"SUM(L19:N19)","v":0}]
[null,"1er certificat de garantie annuel :",null,null,null,null,null,0.85,null,null,null,{"$f":"L19*H20","v":0},{"$f":"M19*H20","v":0}]
{"$rows_left_out":36}
{"sheet":"Calculs","index":5,"n_rows":173,"n_cols":21,"rows_kept":173,"cut":false,"hidden":true,"merged":[[0,7,0,15],[0,1,0,5],[2,0,2,16],[3,0,3,16],[56,2,56,16],[5,2,5,16],[7,3,7,16],[13,2,13,3],[14,2,14,3],[16,2,16,10],[19,2,19,4],[163,10,163,12],[149,10,149,12],[30,8,30,10],[22,3,22,15],[23,3,23,15],[35,2,35,15],[161,2,161,16],[31,8,31,10],[147,2,147,16]]}
[null,null,null,null,null,null,null,"Financement des crédits d'impôt remboursables à la R & D"]
[]
["SCHÉMA D'ANALYSE"]
["Calculs relatifs aux crédits d'impôt à financer"]
[]
[null,null,"1.  ADMISSIBILITÉ AUX CRÉDITS D'IMPÔT REMBOURSABLES"]
[]
[null,null,"1.1"," Admissibilité aux crédits d'impôt remboursables (Québec)"]
[]
[null,null,null,"Date de la fin du premier exercice financier financé :"]
[null,null,null,"Date de la fin du deuxième exercice financier financé :"]
[]
[]
[null,null,"Actifs de :",null,null,null,null,"$","*",null,"en date du :",null,{"$f":"IF(M10=\"\",\"\",IF(M10>DATE(2005,2,28),M10-365,IF(M10<DATE(2004,2,29),M10-365,IF(M10=\"\",0,M10-366))))","v":""}]
[null,null,"Actifs de :",null,null,null,null,"$","*",null,"en date du :",null,{"$f":"IF(M11=\"\",\"\",IF(M11>DATE(2005,2,28),M11-365,IF(M11<DATE(2004,2,29),M11-365,IF(M11=\"\",0,M11-366))))","v":""}]
[]
[null,null,"* : Y compris les actifs des corporations associées, s'il y a lieu",null,null,null,null,null,null,null,null,null,null,null,null,null,null,null,null,1,0.375]
[null,null,null,null,null,null,null,null,null,null,null,null,null,null,null,null,null,null,null,25000000,0.33500000000000002]
[null,null,"Taux de calcul des crédits d'impôt à la R & D sur dépenses admissibles nettes n'excédant pas 2 millions $:",null,null,null,null,null,null,null,null,null,null,null,null,null,null,null,null,30000000,0.29499999999999998]
[null,null,"année teminée:",null,null,null,{"$f":"IF((K39>0),(K39),0)","v":""},":",{"$f":"IF(G14=\"\",\"\",IF(G14>0,VLOOKUP(G14,T17:U22,2),IF(G14<25000000,0.375,0)))","v":""},null,{"$f":"IF((M39>0),(M39),0)","v":""},":",{"$f":"IF(G15=\"\",\"\",IF(G15>0,VLOOKUP(G15,T17:U22,2),IF(G15<25000000,0.375,0)))","v":""},null,null,null,null,null,null,35000000,0.27500000000000002]
{"$rows_left_out":153}