{"text_format":"1","workbook":"xlsx","n_sheets":6,"sheets":["Instructions","Calculs","General Information","Year 1 CALCULATIONS","Financing","XML"],"not_rendered":{"charts":0,"images":13,"macros":1,"external_links":0,"defined_names":456,"comments":4,"pivot_tables":0},"unopened":[],"bounds":{"document_bytes":16777216,"sheet_cells":100000,"rows_first":2000,"rows_last":500,"rows_between":2000,"halvings":0,"cell_chars":16384,"cell_head_chars":4096},"cells_cut":0,"cells_raw":0,"read":"whole","date_system":"1900"}

{"sheet":"Instructions","index":0,"n_rows":120,"n_cols":6,"rows_kept":120,"cut":false,"hidden":false,"merged":[[59,0,59,16],[0,5,0,16],[2,0,2,16],[3,0,3,16]]}
[null,null,null,null,null,"R&D Financing of Working Capital for Export Projects"]
[]
["LOAN / GUARANTEE APPLICATION"]
["Instructions"]
[]
[]
[]
[]
[]
[]
[]
[]
[]
[]
[]
[]
[]
[]
[]
[]
[]
[]
[]
[]
[]
[]
[]
[]
[]
[]
[]
[]
[]
[]
[]
[]
[]
[]
[]
[]
{"$rows_left_out":81}
{"sheet":"Calculs","index":1,"n_rows":173,"n_cols":21,"rows_kept":173,"cut":false,"hidden":true,"merged":[[0,7,0,15],[0,1,0,5],[2,0,2,16],[3,0,3,16],[56,2,56,16],[5,2,5,16],[7,3,7,16],[13,2,13,3],[14,2,14,3],[16,2,16,10],[19,2,19,4],[163,10,163,12],[149,10,149,12],[30,8,30,10],[22,3,22,15],[23,3,23,15],[35,2,35,15],[161,2,161,16],[31,8,31,10],[147,2,147,16]]}
[null,null,null,null,null,null,null,"Financement R-D - Exportation"]
[]
["SCHÉMA D'ANALYSE"]
["Calculs relatifs aux crédits d'impôt à financer"]
[]
[null,null,"1.  ADMISSIBILITÉ AUX CRÉDITS D'IMPÔT REMBOURSABLES"]
[]
[null,null,"1.1"," Admissibilité aux crédits d'impôt remboursables (Québec)"]
[]
[null,null,null,"Date de la fin du premier exercice financier financé :"]
[null,null,null,"Date de la fin du deuxième exercice financier financé :"]
[]
[]
[null,null,"Actifs de :",null,null,null,null,"$","*",null,"en date du :",null,{"$f":"IF(M10=\"\",\"\",IF(M10>DATE(2005,2,28),M10-365,IF(M10<DATE(2004,2,29),M10-365,IF(M10=\"\",0,M10-366))))","v":""}]
[null,null,"Actifs de :",null,null,null,null,"$","*",null,"en date du :",null,{"$f":"IF(M11=\"\",\"\",IF(M11>DATE(2005,2,28),M11-365,IF(M11<DATE(2004,2,29),M11-365,IF(M11=\"\",0,M11-366))))","v":""}]
[]
[null,null,"* : Y compris les actifs des corporations associées, s'il y a lieu",null,null,null,null,null,null,null,null,null,null,null,null,null,null,null,null,1,0.375]
[null,null,null,null,null,null,null,null,null,null,null,null,null,null,null,null,null,null,null,25000000,0.33500000000000002]
[null,null,"Taux de calcul des crédits d'impôt à la R & D sur dépenses admissibles nettes n'excédant pas 2 millions $:",null,null,null,null,null,null,null,null,null,null,null,null,null,null,null,null,30000000,0.29499999999999998]
[null,null,"année teminée:",null,null,null,{"$f":"IF((K39>0),(K39),0)","v":""},":",{"$f":"IF(G14=\"\",\"\",IF(G14>0,VLOOKUP(G14,T17:U22,2),IF(G14<25000000,0.375,0)))","v":""},null,{"$f":"IF((M39>0),(M39),0)","v":""},":",{"$f":"IF(G15=\"\",\"\",IF(G15>0,VLOOKUP(G15,T17:U22,2),IF(G15<25000000,0.375,0)))","v":""},null,null,null,null,null,null,35000000,0.27500000000000002]
[null,null,"Taux de calcul des crédits d'impôt à la R & D sur dépenses admissibles nettes excédant 2 millions $ :",null,null,null,null,null,null,null,null,null,null,null,null,0.17499999999999999,null,null,null,37500000,0.255]
[null,null,null,null,null,null,null,null,null,null,null,null,null,null,null,null,null,null,null,40000000,0.215]
[null,null,"1.2","Admissibilité aux crédits d'impôt remboursables (Canada) pour le financement des EXERCICES",null,null,null,null,null,null,null,null,null,null,null,null,null,null,null,50000000]
[null,null,null,"FINANCIERS 2004 ET SUIVANTS"]
[]
[null,null,"La corporation est une corporation privée à contrôle canadien dont le revenu imposable"]
[null,null,"pour le dernier exercice financier était inférieur à 500 000 $ (y compris les corporations"]
[null,null,"associées s'il y a lieu)."]
[]
[]
[null,null,"Revenu imposable de:",null,null,null,null,"$","Capital imposable:",null,null,null,null,"$","en date du:",{"$f":"+M14","v":""}]
[null,null,"Revenu imposable de:",null,null,null,null,"$","Capital imposable:",null,null,null,null,"$","en date du:",{"$f":"+M15","v":""}]
[]
[]
[]
[null,null,"2. PROJET"]
[]
[null,null,null,null,null,null,null,null,"Année financière débutant le : ",null,{"$f":"IF(K39=\"\",\"\",+K39-365)","v":""},null,{"$f":"IF(M11=\"\",\"\",+K39+1)","v":""}]
[null,null,null,null,null,null,null,null,"Année financière se terminant le : ",null,{"$f":"IF(M10=\"\",\"\",+M10)","v":""},null,{"$f":"IF(M11=\"\",\"\",+M11)","v":""}]
[null,null,null,null,null,null,null,null,null,"(nombre de mois)",{"$f":"IF(K38=\"\",\"\",+(K39-K38)/30.42)","v":""},null,{"$f":"IF(M38=\"\",\"\",+(M39-M38)/30.42)","v":""},null,null,"Total"]
{"$rows_left_out":134}
{"sheet":"General Information","index":2,"n_rows":242,"n_cols":23,"rows_kept":242,"cut":false,"hidden":false,"merged":[[91,22,94,34],[89,14,89,15],[88,9,88,10],[89,9,89,10],[241,2,242,3],[83,14,84,15],[90,9,90,10],[83,2,84,2],[83,3,84,5],[83,6,84,8],[83,9,84,10],[83,11,84,13],[89,2,90,2],[90,3,90,5],[118,10,119,11],[114,14,115,15],[116,14,117,15],[118,14,119,15],[120,6,121,9],[120,14,121,15],[114,6,115,9],[118,6,119,9],[118,12,119,13],[116,12,117,13],[235,13,235,15],[233,2,234,5],[233,6,234,12],[233,13,234,15],[195,2,195,4],[196,2,196,4],[197,6,197,7],[198,6,198,7],[199,6,199,7],[228,13,229,15],[235,2,235,5],[235,6,235,12],[196,6,196,7],[228,2,229,5],[228,6,229,12],[201,6,201,7],[230,2,230,5],[221,1,221,16],[195,6,195,7],[201,14,201,15],[230,6,230,12],[222,0,222,16],[197,2,197,4],[210,2,210,16],[201,12,201,13],[110,10,111,11],[171,7,171,8],[192,6,192,7],[193,6,193,7],[194,6,194,7],[194,2,194,4],[190,2,190,4],[192,2,192,4],[191,2,191,4],[170,2,170,5],[127,1,127,5],[164,2,164,16],[142,1,142,7],[187,14,187,15],[128,14,128,15],[114,12,115,13],[114,10,115,11],[116,10,117,11],[126,14,127,15],[122,14,123,15],[122,10,123,11],[124,6,125,9],[110,14,111,15],[112,1,112,5],[199,14,199,15],[110,12,111,13],[112,12,113,13],[108,6,109,9],[109,1,109,5],[197,12,197,13],[198,12,198,13],[199,12,199,13],[197,8,197,11],[170,12,170,13],[168,14,168,15],[169,14,169,15],[170,14,170,15],[112,6,113,9],[110,1,110,5],[126,12,127,13],[126,10,127,11],[110,6,111,9],[122,12,123,13],[117,1,117,5],[111,1,111,5],[92,1,92,16],[124,14,125,15],[118,1,118,5],[119,1,119,5],[120,1,120,5],[120,10,121,11],[122,1,122,5],[123,1,123,5],[113,1,113,5],[121,1,121,5],[114,1,114,5],[115,1,115,5],[116,1,116,5],[120,12,121,13],[116,6,117,9],[122,6,123,9],[112,14,113,15],[107,6,107,9],[107,1,107,5],[107,12,107,13],[107,10,107,11],[90,6,90,8],[108,1,108,5],[88,14,88,15],[85,2,86,2],[85,3,85,5],[88,3,88,5],[85,9,85,10],[87,3,87,5],[89,3,89,5],[89,6,89,8],[88,6,88,8],[108,14,109,15],[89,11,89,13],[90,11,90,13],[108,12,109,13],[108,10,109,11],[105,1,105,16],[107,14,107,15],[230,13,230,15],[198,14,198,15],[0,7,0,15],[166,7,167,8],[168,7,168,8],[169,7,169,8],[162,1,162,16],[152,1,152,16],[168,2,168,5],[166,10,167,11],[166,12,167,13],[168,12,168,13],[168,10,168,11],[87,14,87,15],[63,6,63,15],[65,4,65,10],[170,10,170,11],[171,2,171,5],[170,7,170,8],[166,14,167,15],[167,2,167,4],[169,10,169,11],[169,2,169,5],[132,1,132,3],[124,10,125,11],[124,12,125,13],[126,6,127,9],[126,1,126,5],[125,1,125,5],[124,1,124,5],[112,10,113,11],[0,0,0,2],[86,3,86,5],[2,0,2,16],[3,0,3,16],[8,8,8,15],[10,5,11,15],[4,1,4,7],[20,1,20,5],[12,5,12,15],[13,5,13,15],[29,6,29,8],[21,3,21,7],[62,0,62,16],[42,0,42,16],[61,1,61,16],[41,6,41,8],[41,13,41,15],[19,9,19,15],[18,1,18,5],[21,11,21,15],[22,11,22,15],[24,1,24,5],[37,6,37,15],[25,6,25,15],[40,6,40,8],[23,11,23,15],[67,4,67,10],[90,14,90,15],[78,3,78,6],[85,11,85,13],[87,11,87,13],[85,6,85,8],[86,6,86,8],[86,11,86,13],[65,14,65,15],[66,4,66,10],[73,1,73,16],[69,10,69,15],[71,3,71,7],[71,11,71,15],[81,3,81,6],[87,6,87,8],[86,9,86,10],[85,14,85,15],[87,9,87,10],[87,2,88,2],[86,14,86,15],[88,11,88,13],[191,14,191,15],[191,8,191,11],[194,8,194,11],[195,8,195,11],[192,8,192,11],[195,12,195,13],[194,12,194,13],[192,12,192,13],[193,12,193,13],[192,14,192,15],[195,14,195,15],[197,14,197,15],[196,14,196,15],[196,8,196,11],[196,12,196,13],[189,12,189,13],[187,12,187,13],[171,10,171,11],[171,12,171,13],[185,2,185,15],[190,6,190,7],[191,6,191,7],[188,8,188,11],[189,8,189,11],[188,6,188,7],[190,12,190,13],[187,6,187,7],[189,6,189,7],[193,14,193,15],[191,12,191,13],[188,12,188,13],[194,14,194,15],[188,14,188,15],[189,14,189,15],[184,2,184,15],[190,8,190,11],[4,8,4,10],[4,12,4,14],[5,12,5,14],[27,6,27,15],[19,1,19,8],[15,5,15,15],[16,5,16,15],[17,5,17,15],[5,8,5,10],[9,8,9,15],[188,2,188,4],[189,2,189,4],[190,14,190,15],[171,14,171,15],[6,1,6,16],[169,12,169,13],[130,0,130,16],[139,1,139,3],[34,6,34,15],[26,6,26,15],[37,1,37,5],[40,13,40,15],[29,13,29,15]]}
[null,null,null,null,null,null,null,"R&D Financing - Exports"]
[]
["LOAN / GUARANTEE APPLICATION"]
["General Information"]
[null,{"$f":"I9","v":0},null,null,null,null,null,null,"Nº. Organisation",null,null,null,"Nº. Dossier"]
[null,null,null,null,null,null,null,null,{"$f":"IF(RNumeroConfirmationDemande<>\"\",\"Nº. Demande\",\"\")","v":""},null,null,null,{"$f":"IF(RDateTransmissionDemande<>\"\",\"transmis le\",\"\")","v":""}]
["1.1 ","IDENTIFICATION"]
[]
[null,"Name of company submitting the application:"]
[null,"NEQ (Québec business number):"]
[]
[null,"Address of head office:"]
[]
[]
[]
[null,"Address of main office"]
[null,"(if different from head office):"]
[]
[]
[null,"Person Investissement Québec should contact:"]
[]
[null,"Title:",null,null,null,null,null,null,null,null,"Phone:"]
[null,null,null,null,null,null,null,null,null,null,"Fax:"]
[null,null,null,null,null,null,null,null,null,null,"E-mail:"]
[]
[null,"Address of contact person"]
[null,"(if different from head office):"]
[]
[]
[null,"Number of employees before the project:",null,null,null,null,null,null,null,null,null,null,"after the project:"]
[]
["1.2 ","INFORMATION ON THE COMPANY"]
[]
[null,"Canada Revenue Agency account"]
[null,"or company number:"]
[null,null,null,null,null,null,"(See \"Corporation Income Tax Return\", T2)"]
[]
[null,"Revenu Québec registration number:"]
[null,null,null,null,null,null,"(See \"Corporation Income Tax Return\", CO-17)"]
[null,null,null,null,null,null,null,null,null,null,null,null,"Date on which"]
{"$rows_left_out":203}
{"sheet":"Year 1 CALCULATIONS","index":3,"n_rows":200,"n_cols":23,"rows_kept":200,"cut":false,"hidden":false,"merged":[[54,11,54,12],[67,11,67,12],[61,11,61,12],[64,11,64,12],[57,11,57,12],[59,11,59,12],[60,11,60,12],[58,11,58,12],[114,3,114,8],[152,3,152,11],[151,3,151,11],[150,3,150,11],[113,3,113,8],[115,11,116,11],[181,2,181,7],[186,9,186,10],[115,3,115,8],[127,2,127,8],[129,2,129,7],[131,2,131,7],[116,3,116,7],[133,2,133,8],[115,9,116,9],[180,2,180,10],[195,9,195,10],[195,11,195,14],[184,11,184,14],[185,11,185,14],[186,11,186,14],[193,9,193,10],[193,11,193,14],[190,2,190,9],[184,9,184,10],[185,9,185,10],[194,9,194,10],[194,11,194,14],[7,11,7,12],[0,7,0,15],[0,1,0,5],[2,0,2,16],[3,0,3,16],[4,2,4,8],[47,11,47,12],[41,11,41,12],[42,11,43,12],[50,11,50,12],[8,2,10,7],[25,2,27,9],[8,11,8,12],[9,11,9,12],[20,11,20,12],[10,11,10,12],[21,11,21,12],[19,11,19,12],[26,11,26,12],[18,11,18,12],[48,11,48,12],[18,2,18,9],[23,2,23,9],[20,7,20,9],[45,11,46,12],[44,11,44,12],[29,11,29,12],[25,11,25,12],[27,11,27,12],[28,11,28,12],[21,3,21,9],[127,18,127,20],[128,18,128,20],[129,18,129,20],[122,15,123,15],[78,13,78,14],[115,15,116,15]]}
[null,null,null,null,null,null,null,"R&D Financing - Exports"]
[]
["LOAN / GUARANTEE APPLICATION"]
["Calculations for tax credits to be financed (year 1)"]
[null,null,{"$f":"'General Information'!I9","v":0},null,null,null,null,null,null,null,{"$f":"'General Information'!I5","v":"Nº. Organisation"},{"$f":"'General Information'!L5","v":0},null,null,{"$f":"'General Information'!M5","v":"Nº. Dossier"},{"$f":"'General Information'!P5","v":0}]
[null,null,null,null,null,null,null,null,null,null,{"$f":"IF(RNumeroConfirmationDemande<>\"\",\"Nº. Demande\",\"\")","v":""},{"$f":"ANumeroConfirmationDemande","v":0},null,null,{"$f":"IF(RDateTransmissionDemande<>\"\",\"transmis le\",\"\")","v":""},{"$f":"ADateTransmissionDemande","v":"00:00:00"},null,null,null,null,"Rate applicable (Québec)  "]
[null,"ELIGIBILITY FOR REFUNDABLE R&D TAX CREDITS",null,null,null,null,null,null,null,null,null,null,null,null,null,null,null,null,null,null,"for net eligible expenses not exceeding $2,000,000"]
[null,null,null,null,null,null,null,null,null,null,null,"(yyyy-mm-dd)",null,null,null,null,null,null,null,null,"(based on assets as per financial statements)"]
[null,null,"First fiscal year to be financed\n(after December 4th, 2006)",null,null,null,null,null,null,"Commencement date:",null,null,null,{"$f":"\"   Be careful :\"","v":"   Be careful :"},null,null,null,null,null,null,"Net eligible expenses"]
[null,null,null,null,null,null,null,null,null,null,null,null,null,null,null,null,null,null,null,null,"(example)"]
[null,null,null,null,null,null,null,null,null,"Termination date:",null,null,null,{"$f":"\"   Does not represent 12 months.\"","v":"   Does not represent 12 months."},null,null,null,null,null,null,null,1,0.375]
[null,null,null,null,null,null,null,null,null,null,null,null,null,null,null,null,null,null,null,null,null,25000000,0.375]
[null,"2.1","Eligibility for refundable R&D tax credits (Québec)",null,null,null,null,null,null,null,null,null,null,null,null,null,null,null,null,null,null,50000000,0.375]
[null,null,null,null,null,null,null,null,null,null,null,null,null,null,null,null,null,null,null,null,null,55000000,0.33500000000000002]
[null,null,null,null,null,null,null,null,null,"The company submitting the application is a Canadian corporation.",null,null,null,null,null,null,null,0,null,null,null,60000000,0.29499999999999998]
[null,null,null,null,null,null,null,null,null,null,null,null,null,null,null,null,null,null,null,null,null,65000000,0.255]
[null,null,null,null,null,null,null,null,null,null,null,null,null,null,null,null,null,null,null,null,null,70000000,0.215]
[null,null,null,null,null,null,null,null,null,null,null,null,null,null,null,null,null,null,null,null,null,75000000,0.17499999999999999]
[null,null,"Assets as per financial statements (year preceding the fiscal year):",null,null,null,null,null,null,null,"$",null,null,null,null,null,null,{"$f":"ROUND(0.375-((MAX(25000000,(MIN(50000000,L19)))-25000000)*0.2)/25000000,4)","v":0.17499999999999999}]
[]
[null,null,null,null,null,null,null,"As at:"]
[null,null,null,"If the company is a start-up, write down $1.",null,null,null,null,null,null,null,{"$f":"L8","v":"(yyyy-mm-dd)"}]
[]
[null,null,"Rate applicable for R&D tax credits on:"]
[null,null,null,null,null,null,null,null,null,null,null,null,null,null,null,null,null,{"$f":"RCalculDateFin1-DATE(2008,3,13)","v":-39520}]
[null,null,{"$f":"\"Rate for net eligible expenses not exceeding  $\"&FIXED(R26,0)&\" :\"","v":"Rate for net eligible expenses not exceeding  $3 000 000 :"},null,null,null,null,null,null,null,null,{"$f":"IF(R15=2,0.175,IF(OR(L19=\"\",L19=0),0,IF(AND(L19>0,R19>0,SaisiTerminer),R19,0)))","v":0},null,null,null,null,null,{"$f":"IF(SaisiTerminer,IF(RCalculDateFin1>DATE(2008,3,13),IF(RCalculDateFin1>DATE(2009,3,13),3000000,ROUND(2000000+((RCalculDateFin1-DATE(2008,3,13))*(1000000/365)),0)),2000000),3000000)","v":3000000}]
[]
[null,null,null,null,null,null,null,null,null,null,null,{"$f":"IF(R15=2,0.175,IF(OR(L19=\"\",L19=0),0,IF(AND(L19>0,R30>0,SaisiTerminer),R30,0)))","v":0}]
[]
[null,null,null,null,null,null,null,null,null,{"$f":"\"Rate for net eligible expenses exceeding $\"&FIXED(R26,0)&\" :\"","v":"Rate for net eligible expenses exceeding $3 000 000 :"},null,{"$f":"0.175","v":0.17499999999999999},null,null,null,null,null,{"$f":"ROUND(0.375-((MAX(50000000,(MIN(75000000,L19)))-50000000)*0.4)/50000000,4)","v":0.17499999999999999}]
[]
[]
[]
[null,"2.2","Eligibility for refundable R&D tax credits (Canada)"]
[]
[]
[null,null,"The company is a private Canadian corporation whose taxable income and",null,null,null,null,null,null,null,null,null,null,null,null,null,null,0]
[null,null,{"$f":"\"taxable capital for the year preceding the fiscal year were below $\" & FIXED(R38,0)","v":"taxable capital for the year preceding the fiscal year were below $800 000"},null,null,null,null,null,null,null,null,null,null,null,null,null,null,{"$f":"IF(SaisiTerminer,IF(RCalculDateFin1>DATE(2008,2,25),IF(RCalculDateFin1>DATE(2009,2,25),IF(RCalculDateFin1>DATE(2009,12,31),IF(RCalculDateFin1>DATE(2010,12,31),800000,700000+((RCalculDateFin1-DATE(2009,12,31))*(100000/365))),700000),600000+((RCalculDateFin1-DATE(2008,2,25))*(100000/366))),600000),800000)","v":800000}]
[null,null,{"$f":"\"and $\" & FIXED(R39,0) & \" respectively (including associated companies, if applicable).\"","v":"and $50 000 000 respectively (including associated companies, if applicable)."},null,null,null,null,null,null,null,null,null,null,null,null,null,null,{"$f":"IF(SaisiTerminer,IF(RCalculDateFin1>DATE(2008,2,25),IF(RCalculDateFin1>DATE(2009,2,25),50000000,15000000+((RCalculDateFin1-DATE(2008,2,25))*(35000000/366))),15000000),50000000)","v":50000000}]
[null,null,null,null,null,null,null,null,null,null,null,null,null,null,null,null,null,{"$f":"IF(SaisiTerminer,IF(RCalculDateFin1>DATE(2009,12,31),IF(RCalculDateFin1>DATE(2010,12,31),500000,400000+((RCalculDateFin1-DATE(2009,12,31))*(100000/365))),400000),500000)","v":500000}]
{"$rows_left_out":161}
{"sheet":"Financing","index":4,"n_rows":52,"n_cols":16,"rows_kept":52,"cut":false,"hidden":false,"merged":[[0,1,0,5],[0,7,0,15],[2,0,2,16],[3,0,3,16],[29,1,29,10],[25,1,25,10],[28,8,28,10],[15,2,15,10],[16,1,16,10],[24,12,24,14],[25,12,25,14],[19,1,19,15],[4,2,4,8],[9,8,9,10],[10,1,10,10],[11,1,11,10],[17,1,17,10],[24,1,24,10],[12,1,12,10],[13,1,13,10],[14,2,14,10],[30,1,30,10],[31,1,31,10],[32,1,32,10],[37,1,37,8],[33,1,33,10],[34,1,34,10],[35,1,35,10],[36,8,36,10]]}
[null,null,null,null,null,null,null,"R&D Financing - Exports"]
[]
["LOAN / GUARANTEE APPLICATION"]
["Calculations related to tax credits"]
[null,null,{"$f":"'General Information'!I9","v":0},null,null,null,null,null,null,null,{"$f":"'General Information'!I5","v":"Nº. Organisation"},{"$f":"'General Information'!L5","v":0},null,null,{"$f":"'General Information'!M5","v":"Nº. Dossier"},{"$f":"'General Information'!P5","v":0}]
[null,null,null,null,null,null,null,null,null,null,{"$f":"IF(RNumeroConfirmationDemande<>\"\",\"Nº. Demande\",\"\")","v":""},{"$f":"ANumeroConfirmationDemande","v":0},null,null,{"$f":"IF(RDateTransmissionDemande<>\"\",\"transmis le\",\"\")","v":""},{"$f":"ADateTransmissionDemande","v":"00:00:00"}]
[null,"4.  MAXIMUM LOAN (in $)"]
[]
[]
[null,null,null,null,null,null,null,null,"Fiscal year ended:",null,null,{"$f":"IF('Year 1 CALCULATIONS'!P80=0,\"\",'Year 1 CALCULATIONS'!P80)","v":""},null,null,null,"Total"]
[null,"Refundable tax credits (Québec) to be financed",null,null,null,null,null,null,null,null,null,{"$f":"IF('Year 1 CALCULATIONS'!P134=0,\"\",'Year 1 CALCULATIONS'!P134)","v":""},null,null,null,{"$f":"L11","v":""}]
[null,"Refundable tax credits (Canada) to be financed",null,null,null,null,null,null,null,null,null,{"$f":"IF('Year 1 CALCULATIONS'!P200=0,\"\",'Year 1 CALCULATIONS'!P200)","v":""},null,null,null,{"$f":"L12","v":""}]
[null,"Total credits for the year",null,null,null,null,null,null,null,null,null,{"$f":"IF(ISERROR(L11+L12),\"\",L11+L12)","v":""},null,null,null,{"$f":"L13","v":""}]
[null,"Maximum loan at 85%",null,null,null,null,null,null,null,null,null,{"$f":"IF(ISERROR(L13*0.85),\"\",ROUND(L13*0.85,0))","v":""},null,null,null,{"$f":"IF(L14=0,\"\",L14)","v":""}]
[null,null,"Montant financé par le dossier précédent",null,null,null,null,null,null,null,null,null,null,null,null,{"$f":"L15","v":0}]
[null,null,"Montant à financer par ce nouveau dossier",null,null,null,null,null,null,null,null,{"$f":"IF(ISERROR(L14-L15),\"\",L14-L15)","v":""},null,null,null,{"$f":"L16","v":""}]
[null,"Portion financée (en %)",null,null,null,null,null,null,null,null,null,{"$f":"IF(ISERROR(IF((L13)>0,(L18/L13),0)),\"\",IF((L13)>0,(L18/L13),0))","v":""},null,null,null,{"$f":"IF(ISERROR(IF((P13)>0,(P18/P13),0)),\"\",IF((P13)>0,(P18/P13),0))","v":""}]
[null,"Crédits financés (année courante, arrondis)",null,null,null,null,null,null,null,null,null,null,null,null,null,{"$f":"L18","v":0}]
[null,"1er certificat de garantie annuel :",null,null,null,0.85,null,null,null,{"$f":"IF(J18*F19=0,\"\",J18*F19)","v":""},null,{"$f":"IF(L18*F19=0,\"\",L18*F19)","v":""}]
[null,"The total loan amount must exceed $58,825"]
[]
[]
[null,"5. FINANCEMENT (en $)"]
[]
[null,"Exercice financier terminé le : ",null,null,null,null,null,null,null,null,null,{"$f":"IF('Year 1 CALCULATIONS'!P80=0,\"\",'Year 1 CALCULATIONS'!P80)","v":""},null,null,null,"Total"]
[null,"Total des dépenses (report des feuilles Calculs.)",null,null,null,null,null,null,null,null,null,{"$f":"'Year 1 CALCULATIONS'!P96","v":0},null,null,null,{"$f":"L26","v":0}]
[]
[]
[null,null,null,null,null,null,null,null,"Exercice terminé le :",null,null,{"$f":"L10","v":""},null,null,null,"Total"]
[null,"Actions ord. - Promoteurs (mise de fonds)",null,null,null,null,null,null,null,null,null,null,null,null,null,{"$f":"L30","v":0}]
[null,"Actions priv. - Promoteurs (mise de fonds)",null,null,null,null,null,null,null,null,null,null,null,null,null,0]
[null,"Avance d'actionnaires",null,null,null,null,null,null,null,null,null,null,null,null,null,0]
[null,"Crédits d'impôt (non financés par IQ)",null,null,null,null,null,null,null,null,null,{"$f":"IF(ISERROR(L13-L18),\"\",L13-L18)","v":""},null,null,null,""]
[null,"Fonds de roulement",null,null,null,null,null,null,null,null,null,null,null,null,null,0]
[null,"Prêt garanti par IQ",null,null,null,null,null,null,null,null,null,{"$f":"L18","v":0},null,null,null,0]
[null,"Autre (préciser) :",null,null,null,null,null,null,null,null,null,null,null,null,null,0]
[null,null,null,null,null,null,null,null,"Total",null,null,{"$f":"IF(SUM(L30:L36)=0,\"\",SUM(L30:L36))","v":""},null,null,null,""]
[null,"Le total des dépenses doit être égal au total du financement"]
[]
[null,"6. MONTANT GARANTI ET HONORAIRES"]
{"$rows_left_out":13}
{"sheet":"XML","index":5,"n_rows":292,"n_cols":20,"rows_kept":292,"cut":false,"hidden":true,"merged":[]}
["SCHÉMA D'ANALYSE - IDENTIFICATION"]
[]
[]
["NumeroConfirmationDemande","DateTransmissionDemande"]
[null,null,{"$f":"LEFT(XDateTransmissionDemande,10)","v":""}]
[]
["RaisonSocialEntreprise","NumeroEntrepriseQuebec"]
[]
[]
["AdresseLigne1SC","AdresseLigne2SC","Adresse1SC"]
[null,null,{"$f":"IF(XAdresseLigne1SC<>\"\",IF(XAdresseLigne2SC<>\"\",CONCATENATE(XAdresseLigne1SC,\", \",XAdresseLigne2SC),XAdresseLigne1SC),IF(XAdresseLigne2SC<>\"\",XAdresseLigne2SC,\"\"))","v":""}]
[]
["VilleSC","ProvinceSC","Adresse2SC"]
[null,null,{"$f":"IF(XVilleSC<>\"\",IF(XProvinceSC<>\"\",CONCATENATE(XVilleSC,\", \",XProvinceSC),XVilleSC),IF(XProvinceSC<>\"\",XProvinceSC,\"\"))","v":""}]
[]
["PaysSC","CodePostalSC","Adresse3SC"]
[null,null,{"$f":"IF(XPaysSC<>\"\",IF(XCodePostalSC<>\"\",CONCATENATE(XPaysSC,\"          \",UPPER(XCodePostalSC)),XPaysSC),IF(XCodePostalSC<>\"\",UPPER(XCodePostalSC),\"\"))","v":""}]
[]
["AdresseLigne1BP","AdresseLigne2BP","Adresse1BP"]
[null,null,{"$f":"IF(XAdresseLigne1BP<>\"\",IF(XAdresseLigne2BP<>\"\",CONCATENATE(XAdresseLigne1BP,\", \",XAdresseLigne2BP),XAdresseLigne1BP),IF(XAdresseLigne2BP<>\"\",XAdresseLigne2BP,\"\"))","v":""}]
[]
["VilleBP","ProvinceBP","Adresse2BP"]
[null,null,{"$f":"IF(XVilleBP<>\"\",IF(XProvinceBP<>\"\",CONCATENATE(XVilleBP,\", \",XProvinceBP),XVilleBP),IF(XProvinceBP<>\"\",XProvinceBP,\"\"))","v":""}]
[]
["PaysBP","CodePostalBP","Adresse3BP"]
[null,null,{"$f":"IF(XPaysBP<>\"\",IF(XCodePostalBP<>\"\",CONCATENATE(XPaysBP,\"          \",UPPER(XCodePostalBP)),XPaysBP),IF(XCodePostalBP<>\"\",UPPER(XCodePostalBP),\"\"))","v":""}]
[]
["NombreEmployesAvantProjet","NombreEmployesApresProjet"]
[]
[]
["PersonneContact","TitrePC"]
[]
[]
["TelephonePC","TelecopieurPC"]
[]
[]
["CourrierElectroniquePC"]
[]
[]
["AdresseLigne1PC","AdresseLigne2PC","Adresse1PC"]
{"$rows_left_out":252}