{"text_format":"1","workbook":"xlsx","n_sheets":4,"sheets":["Instructions","Application Certificate","Appendix A","Appendix B"],"not_rendered":{"charts":0,"images":1,"macros":0,"external_links":2,"defined_names":21,"comments":1,"pivot_tables":0},"unopened":[],"bounds":{"document_bytes":16777216,"sheet_cells":100000,"rows_first":2000,"rows_last":500,"rows_between":2000,"halvings":0,"cell_chars":16384,"cell_head_chars":4096},"cells_cut":0,"cells_raw":0,"read":"whole","date_system":"1900"}

{"sheet":"Instructions","index":0,"n_rows":137,"n_cols":14,"rows_kept":137,"cut":false,"hidden":false,"merged":[[99,0,99,37],[90,1,90,37],[92,0,92,37],[91,0,91,37],[110,0,110,37],[89,0,89,37],[129,0,129,37],[86,0,86,4],[86,5,86,37],[104,0,104,37],[105,0,105,37],[108,1,108,37],[106,4,106,37],[53,0,53,37],[54,1,54,37],[30,0,30,37],[37,0,37,37],[51,0,51,37],[50,0,50,37],[44,0,44,37],[47,0,47,37],[42,0,42,37],[74,0,74,37],[75,0,75,37],[65,0,65,37],[68,0,68,37],[87,0,87,37],[88,0,88,37],[82,5,82,37],[83,0,83,37],[84,0,84,37],[85,0,85,37],[76,0,76,4],[66,5,66,37],[66,0,66,4],[70,0,70,4],[70,5,70,37],[72,0,72,37],[73,0,73,37],[80,0,80,37],[77,0,77,37],[78,0,78,37],[79,0,79,37],[76,5,76,37],[81,0,81,37],[82,0,82,4],[29,0,29,37],[31,0,31,37],[32,0,32,37],[33,0,33,37],[34,0,34,37],[35,0,35,37],[39,0,39,37],[40,0,40,37],[41,0,41,37],[36,0,36,37],[38,0,38,37],[0,0,0,12],[0,13,0,37],[1,0,2,37],[5,0,5,37],[3,0,3,37],[71,0,71,37],[58,0,58,37],[46,0,46,37],[52,0,52,37],[56,0,56,37],[43,0,43,37],[57,0,57,37],[49,0,49,37],[59,0,59,37],[45,0,45,37],[55,0,55,37],[63,0,63,37],[69,0,69,37],[64,3,64,37],[64,0,64,2],[67,0,67,37],[48,1,48,37],[60,0,60,37],[62,0,62,37],[137,0,137,37],[134,0,134,37],[132,1,132,37],[133,0,133,37],[135,1,135,37],[136,1,136,37],[107,0,107,37],[114,0,114,37],[115,0,115,37],[116,0,116,37],[119,0,119,37],[118,0,118,37],[127,0,127,37],[128,0,128,37],[113,0,113,37],[131,0,131,37],[117,0,117,37],[120,0,120,37],[130,1,130,37],[4,0,4,37],[6,0,6,37],[8,0,8,37],[9,0,9,37],[10,0,10,37],[11,0,11,37],[23,0,23,37],[24,0,24,37],[25,0,25,37],[7,0,7,37],[12,0,12,37],[13,0,13,37],[14,0,14,37],[15,0,15,37],[16,0,16,37],[17,0,17,37],[20,0,20,37],[21,0,21,37],[22,0,22,37],[18,0,18,37],[19,0,19,37],[26,0,26,37],[27,0,27,37],[28,0,28,37],[121,0,121,37],[122,0,122,37],[123,0,123,37],[124,0,124,37],[125,0,125,37],[126,0,126,37],[98,1,98,37],[93,0,93,37],[94,1,94,37],[96,0,96,37],[97,0,97,37],[95,0,95,37],[106,0,106,3],[111,0,111,37],[112,1,112,37],[100,0,100,37],[101,0,101,37],[102,1,102,37],[103,0,103,37],[109,0,109,37],[61,0,61,37]]}
[null,null,null,null,null,null,null,null,null,null,null,null,null,"Tax Credits Available\n in Resource Regions\nVersion : 2016-05-01"]
["Instructions – \nApplication for a Business Qualification Certificate and an Employee Certificate"]
[]
["This document is designed for companies that hold an initial qualification certificate for one of the tax credits available in the resource regions, namely the tax credit for processing activities in the resource regions,  the tax credit for Gaspésie and certain maritime regions of Québec, the tax credit for Gaspésie and certain maritime regions of Québec (fields of marine biotechnology, mariculture, marine products processing and recreational tourism), and the tax credit for Aluminum Valley. It describes the procedure for completing all the application forms for business qualification certificates and employee certificates. Claims for tax credits are made by completing a CO-17 income tax return with the relevant schedules and filing it with Revenu Québec within the prescribed deadline."]
["We strongly encourage you to consult the detailed fact sheet on our website concerning the tax credit you are applying for before completing this form. Be sure to use the most up-to-date version of the form. In addition, you can consult Chapters XI and XII of Schedule A of the Act respecting the sectoral parameters of certain fiscal measures, which includes all the sectoral parameters applicable to this measure. "]
[]
["APPLICABLE DEADLINES FOR FISCAL YEARS STARTING BEFORE MARCH 27, 2015"]
["Under the Taxation Act, the corporation has eighteen (18) months to submit an application for a tax credit to Revenu Québec; the application must include the business qualification certificate and employee certificates issued by Investissement Québec. This deadline is mandatory but it may be extended by Revenu Québec in certain situations and under certain conditions, in particular when Investissement Québec receives a complete application by the last day of the fifteenth (15th) month following the end of the corporation's fiscal year, at the latest. "]
[]
["In general, Investissement Québec does not grant priority in processing files. Thus, if the Application for a Business Qualification Certificate and an Employee Certificate is filed after the end of the fifteenth (15th) month following the end of the corporation's fiscal year, Investissement Québec cannot guarantee that the corporation will obtain its certificates before the expiration of the eighteen (18) month period following the end of its fiscal year."]
[]
["Consequently, we strongly recommend that you file the Application for a Business Qualification Certificate and an Employee Certificate to Investissement Québec before the end of the fifteenth (15th) month following the end of the corporation's fiscal year during which the calendar year for which the corporation is claiming a credit ends. For example, if the fiscal year ends on March 31, you must file your Application for a Business Qualification Certificate and an Employee Certificate for the 2014 calendar year no earlier than April 1, 2015."]
[]
["APPLICABLE DEADLINES FOR FISCAL YEARS STARTING AFTER MARCH 26, 2015"]
["In the 2015–2016 budget of March 26, 2015, the rules were amended regarding deadlines for submission of an application for a refundable tax credit for fiscal years starting after March 26, 2015."]
[]
["Filing of an application for an annual certificate with Investissement Québec"]
["The corporation must file its application for an annual qualification certificate with Investissement Québec before the expiration of the 15th month following the end of the corporation's fiscal year. If the application is filed after that date but before the expiration of the 18-month period following the end of the corporation's fiscal year, Investissement Québec may, at its discretion, accept the application if it considers that the grounds for the delay are reasonable and justify such a \"late\" application. Consequently, if you are in such a situation, please attach a document setting out the grounds for your delay."]
[]
["Nevertheless, an application for a qualification certificate filed with Investissement Québec after the expiration of the 18-month period will be refused."]
[]
["Submission of documents to Revenu Québec"]
["The corporation must submit its application for a tax credit and its certificates to Revenu Québec by the later of the following dates:\n   - The last day of the 18th month following the end of the corporation's fiscal year in question\n   - The last day of the 3-month period following the date of issuance of the certificates by Investissement Québec."]
[]
["In addition, only complete applications will be processed. Any application received prior to the end of the fiscal year in question will be returned to the applicant. "]
[]
["A complete application* includes:\n   - A duly completed and signed Application for a Business Qualification Certificate and an Employee Certificate;\n   - Appendices A and B;\n   - The corporation's non-consolidated financial statements (balance sheet and income statement) for the fiscal year in \n     question.**"]
["Note that Investissement Québec indicates the date of receipt of the complete application on the certificates. Consequently, it is your responsibility to respect the deadlines prescribed by Revenu Québec, since the corporation could otherwise lose its right to receive its tax credit for a given year. "]
["* Please note that the documents required for a complete application do not exempt the corporation from the obligation to provide the documents mentioned in section 9 of the Application for a Business Qualification Certificate and an Employee Certificate.   \n** Financial statements can be in draft form, provided that you send us a final version of the statements as soon as they are available."]
[]
["INFORMATION ABOUT COMPLETING THE FORMS"]
[]
["Application for a Business Qualification Certificate"]
[]
["A single application must be submitted for all eligible activities carried out by the corporation during the calendar year covered by the application."]
[]
[]
["Application for an Employee Certificate for the Calendar Year of Eligibility"]
[]
["This application must be completed for the calendar year of eligibility for which the corporation is claiming the tax credit. Complete a single application for each year for all corporation employees, whether or not the corporation is eligible for more than one tax credit available in resource regions."]
{"$rows_left_out":98}
{"sheet":"Application Certificate","index":1,"n_rows":163,"n_cols":36,"rows_kept":163,"cut":false,"hidden":false,"merged":[[78,7,78,37],[76,0,76,6],[76,7,76,37],[68,0,68,6],[61,0,61,6],[58,0,58,37],[67,0,67,6],[67,7,67,37],[59,7,59,37],[62,0,62,37],[63,0,63,37],[66,0,66,37],[59,0,59,6],[61,7,61,37],[73,7,73,37],[160,0,160,33],[0,0,0,12],[4,0,4,37],[1,0,1,37],[0,13,0,37],[2,0,2,37],[3,0,3,37],[69,7,69,37],[85,0,85,6],[45,0,45,37],[46,0,46,37],[75,0,75,37],[48,0,48,6],[49,0,49,6],[50,0,50,37],[51,0,51,6],[51,7,51,37],[57,0,57,6],[49,7,49,37],[69,0,69,6],[47,7,47,37],[48,7,48,37],[54,0,54,37],[55,0,55,6],[162,0,162,20],[162,21,162,28],[162,29,162,37],[155,0,155,37],[161,0,161,20],[161,29,161,37],[161,21,161,28],[154,0,154,37],[102,0,102,37],[103,0,103,31],[103,32,103,34],[103,35,103,37],[120,0,120,37],[117,0,117,31],[117,34,117,35],[118,0,118,37],[119,0,119,37],[116,0,116,31],[116,32,116,34],[116,35,116,37],[156,0,156,37],[157,1,157,33],[158,0,158,33],[159,1,159,33],[5,0,5,37],[13,0,13,37],[14,0,14,37],[11,0,11,37],[7,23,7,37],[8,0,8,37],[9,1,9,37],[7,1,7,17],[10,1,10,30],[12,0,12,37],[105,0,105,37],[106,0,106,37],[110,0,110,31],[86,0,86,6],[86,7,86,37],[70,7,70,37],[79,0,79,37],[73,0,73,6],[77,0,77,6],[85,7,85,37],[81,0,81,6],[81,7,81,37],[82,0,82,6],[82,7,82,37],[83,0,83,37],[84,0,84,6],[84,7,84,37],[77,7,77,37],[80,0,80,6],[80,7,80,37],[101,0,101,37],[74,7,74,37],[72,0,72,6],[72,7,72,37],[115,0,115,37],[112,0,112,37],[107,0,107,37],[108,0,108,37],[109,0,109,31],[109,32,109,34],[109,35,109,37],[113,0,113,37],[114,0,114,37],[110,34,110,35],[111,0,111,37],[36,0,36,25],[37,0,37,25],[37,27,37,33],[38,0,38,25],[27,35,27,37],[28,27,28,34],[28,35,28,37],[53,7,53,37],[47,0,47,6],[29,0,29,37],[30,0,30,25],[31,0,31,25],[31,27,31,34],[31,35,31,37],[39,0,39,37],[30,35,30,37],[30,27,30,34],[32,0,32,37],[35,35,35,37],[36,35,36,37],[36,27,36,34],[52,0,52,6],[52,7,52,37],[53,0,53,6],[55,7,55,37],[71,0,71,37],[60,0,60,6],[60,7,60,37],[68,7,68,37],[104,0,104,31],[104,34,104,35],[40,0,40,37],[42,31,42,32],[42,33,42,37],[42,26,42,30],[42,0,42,10],[42,11,42,15],[42,17,42,25],[43,0,43,37],[44,0,44,37],[41,0,41,37],[74,0,74,6],[88,1,88,37],[70,0,70,6],[56,0,56,6],[56,7,56,37],[57,7,57,37],[78,0,78,6],[16,0,16,7],[16,10,16,17],[16,20,16,27],[27,27,27,34],[23,0,23,37],[24,0,24,37],[25,0,25,25],[16,30,16,37],[17,0,17,7],[17,10,17,17],[17,20,17,27],[25,26,25,37],[17,30,17,37],[18,0,18,37],[21,0,21,37],[22,26,22,37],[15,0,15,37],[22,0,22,25],[26,0,26,37],[27,0,27,25],[128,0,128,16],[128,17,128,23],[128,24,128,30],[128,31,128,37],[122,0,122,37],[124,0,124,37],[121,0,121,37],[125,0,125,37],[126,0,126,37],[127,0,127,16],[127,17,127,23],[127,24,127,30],[127,31,127,37],[33,0,33,33],[34,0,34,25],[34,26,34,33],[35,0,35,25],[35,27,35,32],[38,27,38,32],[28,0,28,25],[133,24,133,30],[133,31,133,37],[134,0,134,37],[129,1,129,16],[129,17,129,23],[129,24,129,30],[129,31,129,37],[130,1,130,16],[130,17,130,23],[130,24,130,30],[130,31,130,37],[131,1,131,16],[131,17,131,23],[131,24,131,30],[131,31,131,37],[147,1,147,34],[148,1,148,34],[149,1,149,37],[150,1,150,37],[151,0,151,37],[152,0,152,37],[153,0,153,37],[6,0,6,37],[19,0,19,37],[20,0,20,37],[64,0,64,37],[65,0,65,37],[135,0,135,37],[136,1,136,34],[137,0,137,33],[138,1,138,34],[139,0,139,33],[140,1,140,34],[141,1,141,30],[142,0,142,33],[146,1,146,34],[132,1,132,16],[132,17,132,23],[132,24,132,30],[143,1,143,35],[144,1,144,36],[145,0,145,33],[87,0,87,37],[89,1,89,17],[89,30,89,31],[90,0,90,37],[91,1,92,29],[91,30,92,31],[93,1,94,29],[93,30,94,31],[95,1,95,7],[95,8,95,29],[96,1,96,29],[96,30,96,31],[97,1,98,29],[97,30,98,31],[99,1,99,7],[99,8,99,29],[100,1,100,29],[100,30,100,31],[132,31,132,37],[133,0,133,16],[133,17,133,23]]}
[null,null,null,null,null,null,null,null,null,null,null,null,null,"Certified Business\nVersion : 2016-05-01"]
["Application for a Business Qualification Certificate and \nan Employee Certificate"]
[]
["Before completing this form, please read the instructions. "]
["1. REFUNDABLE TAX CREDIT CONCERNED"]
[]
["A single application must be submitted for all the corporation's eligible activities during the calendar year covered by this application."]
[null,"Gaspésie and Certain Maritime Regions of Québec"]
[]
[null,"Gaspésie and Certain Maritime Regions of Québec (fields of marine biotechnology, mariculture, marine products processing"]
[null,"and recreational tourism)"]
[]
["2. IDENTIFICATION OF THE CORPORATION"]
["Corporation name"]
[]
[]
["NEQ (Québec enterprise number)",null,null,null,null,null,null,null,null,null,"IQ business number*",null,null,null,null,null,null,null,null,null,"IQ file number*",null,null,null,null,null,null,null,null,null,"Date of incorporation"]
[]
[]
["Business or file number assigned by Investissement Québec (IQ) for the tax credit(s) available in resources regions. Not required for the initial application. In the case of a second application, you will find these numbers on the correspondence received from IQ."]
[]
["Mailing address"]
[]
[]
["Corporation's authorized representative"]
[]
[]
["Title",null,null,null,null,null,null,null,null,null,null,null,null,null,null,null,null,null,null,null,null,null,null,null,null,null,null,"Telephone",null,null,null,null,null,null,null,"Extension"]
[]
[]
["Email",null,null,null,null,null,null,null,null,null,null,null,null,null,null,null,null,null,null,null,null,null,null,null,null,null,null,"Fax"]
[]
[]
["Corporation's authorized agent (if applicable)"]
[]
["Agent's title",null,null,null,null,null,null,null,null,null,null,null,null,null,null,null,null,null,null,null,null,null,null,null,null,null,null,"Telephone",null,null,null,null,null,null,null,"Extension"]
[]
["Agent's email address",null,null,null,null,null,null,null,null,null,null,null,null,null,null,null,null,null,null,null,null,null,null,null,null,null,null,"Fax"]
[]
[]
{"$rows_left_out":124}
{"sheet":"Appendix A","index":2,"n_rows":35,"n_cols":27,"rows_kept":35,"cut":false,"hidden":false,"merged":[[14,0,14,10],[15,0,15,10],[17,0,17,10],[18,7,21,7],[18,4,20,5],[18,6,21,6],[16,0,16,3],[16,4,16,6],[16,7,16,10],[18,10,21,10],[18,9,21,9],[18,0,21,0],[18,1,21,1],[18,2,21,2],[18,3,21,3],[18,8,21,8],[7,1,7,5],[7,7,7,8],[0,0,0,2],[0,3,0,10],[1,0,1,10],[2,0,2,10],[3,35,3,37],[3,1,3,9],[4,0,4,10],[5,1,5,4],[6,0,6,10],[12,8,12,9],[13,0,13,10],[8,1,8,5],[9,0,9,10],[10,1,10,2],[10,7,10,8],[10,9,10,10]]}
[null,null,null,"Version : 2016-05-01"]
["Appendix A—Application for an Employee Certificate – Calendar Year of Eligibility"]
["(Appendix A is an integral part of this application.)"]
[null,"Before completing this appendix, please read the instructions."]
["Refundable tax credits concerned"]
[]
[]
[null,"Corporation name",null,null,null,null,null,"IQ file number",null,"NEQ"]
[null,{"$f":"IF('Application Certificate'!A15=\"\",\"\",'Application Certificate'!A15)","v":""},null,null,null,null,null,{"$f":"IF('Application Certificate'!U18=\"\",\"\",'Application Certificate'!U18)","v":""},null,{"$f":"IF('Application Certificate'!A18=\"\",\"\",'Application Certificate'!A18)","v":""}]
[]
[null,"Calendar year of eligibility",null,"Fiscal year from","from",null,"to",null,null,"IQ business number "]
[null,{"$f":"IF('Application Certificate'!L43=\"\",\"\",'Application Certificate'!L43)","v":""},null,null,{"$f":"IF('Application Certificate'!AA43=\"\",\"\",'Application Certificate'!AA43)","v":""},null,{"$f":"IF('Application Certificate'!AH43=\"\",\"\",'Application Certificate'!AH43)","v":""},null,null,{"$f":"IF('Application Certificate'!K18=\"\",\"\",'Application Certificate'!K18)","v":""}]
[null,"(yyyy)",null,null,"(yyyy-mm-dd)",null,"(yyyy-mm-dd)"]
[]
["Please complete fiscal year fields before completing the table."]
[]
["Type of pay period (e.g. weekly, biweekly, semimonthly or monthly):"]
[]
["Employee name\nEnter as follows:                                Last name(1 space)First name","S.I.N.\n999-999-999","Position (Complete Appendix B for each of these positions.)\nExample:                                                  Heavy machinery operator","Establishment (address)\nEnter as follows:                                                999, rue XXXXXXXXX, Suite 99, City (Québec) X9X 9X9","Employment period during calendar year of eligibility",null,"Total number of pay periods worked","Number of eligible pay periods"," Total wages or salary for year\nExample:                     $45,550.00","Eligible wages or salary\nExample:          $35,550.00","Comments"]
[]
[]
[null,null,null,null,"From:                           (yyyy-mm-dd)","To:                                     (yyyy-mm-dd)"]
[null,null,null,null,null,null,null,null,null,null,null,null,null,null,null,null,null,null,null,null,null,null,null,null,null,null,{"$f":"IF(ISBLANK($F23),AND($E23>=DATE($B$12,1,1),$E23<=DATE($B$12,12,31)),AND($E23>=DATE($B$12,1,1),$E23<=DATE($B$12,12,31),$E23<=$F23))","v":{"$error":"#VALUE!"}}]
[null,null,null,null,null,null,null,null,null,null,null,null,null,null,null,null,null,null,null,null,null,null,null,null,null,null,{"$f":"IF(ISBLANK($F24),AND($E24>=DATE($B$12,1,1),$E24<=DATE($B$12,12,31)),AND($E24>=DATE($B$12,1,1),$E24<=DATE($B$12,12,31),$E24<=$F24))","v":{"$error":"#VALUE!"}}]
[null,null,null,null,null,null,null,null,null,null,null,null,null,null,null,null,null,null,null,null,null,null,null,null,null,null,{"$error":"#VALUE!"}]
[null,null,null,null,null,null,null,null,null,null,null,null,null,null,null,null,null,null,null,null,null,null,null,null,null,null,{"$error":"#VALUE!"}]
[null,null,null,null,null,null,null,null,null,null,null,null,null,null,null,null,null,null,null,null,null,null,null,null,null,null,{"$error":"#VALUE!"}]
[null,null,null,null,null,null,null,null,null,null,null,null,null,null,null,null,null,null,null,null,null,null,null,null,null,null,{"$error":"#VALUE!"}]
[null,null,null,null,null,null,null,null,null,null,null,null,null,null,null,null,null,null,null,null,null,null,null,null,null,null,{"$error":"#VALUE!"}]
[null,null,null,null,null,null,null,null,null,null,null,null,null,null,null,null,null,null,null,null,null,null,null,null,null,null,{"$error":"#VALUE!"}]
[null,null,null,null,null,null,null,null,null,null,null,null,null,null,null,null,null,null,null,null,null,null,null,null,null,null,{"$error":"#VALUE!"}]
[null,null,null,null,null,null,null,null,null,null,null,null,null,null,null,null,null,null,null,null,null,null,null,null,null,null,{"$error":"#VALUE!"}]
[null,null,null,null,null,null,null,null,null,null,null,null,null,null,null,null,null,null,null,null,null,null,null,null,null,null,{"$error":"#VALUE!"}]
[null,null,null,null,null,null,null,null,null,null,null,null,null,null,null,null,null,null,null,null,null,null,null,null,null,null,{"$error":"#VALUE!"}]
[null,null,null,null,null,null,null,null,null,null,null,null,null,null,null,null,null,null,null,null,null,null,null,null,null,null,{"$error":"#VALUE!"}]

{"sheet":"Appendix B","index":3,"n_rows":51,"n_cols":42,"rows_kept":51,"cut":false,"hidden":false,"merged":[[5,0,5,1],[5,2,5,4],[5,25,5,27],[6,0,6,4],[1,0,1,4],[2,0,2,4],[3,0,3,4],[4,0,4,4],[14,0,14,2],[15,0,15,1],[15,2,15,4],[16,2,16,4],[7,0,7,4],[11,0,11,2],[12,0,12,2],[13,0,13,2],[8,0,8,4],[9,0,9,4],[50,0,50,4],[17,0,17,4],[18,1,18,4],[20,0,20,1],[20,2,20,3]]}
[null,null,null,null,"Version 2016-05-01"]
["Appendix B—Application for an Employee Certificate"]
["for the Calendar Year of Eligibility"]
["(Appendix B is an integral part of this application.)\n\nBefore completing this appendix, please read the instructions.  Please provide the requested information for all employees (whether eligible or not) who, during the calendar year of eligibility, were assigned to all the corporation's activities."]
["REFUNDABLE TAX CREDITS CONCERNED"]
[]
[]
["Use one Appendix B for each position. However, if the responsibilities and tasks are in all respects identical for more than one employee for the calendar year of eligibility, use a single appendix and list the employees concerned on the \"Incumbent(s)\" line."]
["For further details, refer to our \"Guidelines for Task Descriptions on Eligibility Certificate Applications,\" available on our website at: http://www.investquebec.com/documents/fr/publications/NouvellesLignesDirectrices_MesuresFiscales.pdf"]
["The job description includes all of the responsibilities and tasks performed by the employee for the corporation."]
[]
["Corporation name",null,null,null,"IQ file number "]
[{"$f":"IF('Application Certificate'!A15=\"\",\"\",'Application Certificate'!A15)","v":""},null,null,null,{"$f":"IF('Application Certificate'!U18=\"\",\"\",'Application Certificate'!U18)","v":""}]
[" ",null,null,null,"Calendar year of eligibility"]
[" ",null,null,null,{"$f":"IF('Application Certificate'!L43=\"\",\"\",'Application Certificate'!L43)","v":""}]
["Job title",null,"Immediate superior"]
[]
["Incumbent(s)"]
[]
[]
["Detailed description of responsibilities and tasks",null,"Time dedicated to these activities (%)",null,"Reserved for IQ"]
[null,null,null,null,null,null,null,null,null,null,null,null,null,null,null,null,null,null,null,null,null,null,null,null,null,null,null,null,null,null,null,null,null,null,null,null,null,null,null,null,null,{"$f":"A22","v":0}]
[null,null,null,null,null,null,null,null,null,null,null,null,null,null,null,null,null,null,null,null,null,null,null,null,null,null,null,null,null,null,null,null,null,null,null,null,null,null,null,null,null,{"$f":"A23","v":0}]
[null,null,null,null,null,null,null,null,null,null,null,null,null,null,null,null,null,null,null,null,null,null,null,null,null,null,null,null,null,null,null,null,null,null,null,null,null,null,null,null,null,0]
[null,null,null,null,null,null,null,null,null,null,null,null,null,null,null,null,null,null,null,null,null,null,null,null,null,null,null,null,null,null,null,null,null,null,null,null,null,null,null,null,null,0]
[null,null,null,null,null,null,null,null,null,null,null,null,null,null,null,null,null,null,null,null,null,null,null,null,null,null,null,null,null,null,null,null,null,null,null,null,null,null,null,null,null,0]
[null,null,null,null,null,null,null,null,null,null,null,null,null,null,null,null,null,null,null,null,null,null,null,null,null,null,null,null,null,null,null,null,null,null,null,null,null,null,null,null,null,0]
[null,null,null,null,null,null,null,null,null,null,null,null,null,null,null,null,null,null,null,null,null,null,null,null,null,null,null,null,null,null,null,null,null,null,null,null,null,null,null,null,null,0]
[null,null,null,null,null,null,null,null,null,null,null,null,null,null,null,null,null,null,null,null,null,null,null,null,null,null,null,null,null,null,null,null,null,null,null,null,null,null,null,null,null,0]
[null,null,null,null,null,null,null,null,null,null,null,null,null,null,null,null,null,null,null,null,null,null,null,null,null,null,null,null,null,null,null,null,null,null,null,null,null,null,null,null,null,0]
[null,null,null,null,null,null,null,null,null,null,null,null,null,null,null,null,null,null,null,null,null,null,null,null,null,null,null,null,null,null,null,null,null,null,null,null,null,null,null,null,null,0]
[null,null,null,null,null,null,null,null,null,null,null,null,null,null,null,null,null,null,null,null,null,null,null,null,null,null,null,null,null,null,null,null,null,null,null,null,null,null,null,null,null,0]
[null,null,null,null,null,null,null,null,null,null,null,null,null,null,null,null,null,null,null,null,null,null,null,null,null,null,null,null,null,null,null,null,null,null,null,null,null,null,null,null,null,0]
[null,null,null,null,null,null,null,null,null,null,null,null,null,null,null,null,null,null,null,null,null,null,null,null,null,null,null,null,null,null,null,null,null,null,null,null,null,null,null,null,null,0]
[null,null,null,null,null,null,null,null,null,null,null,null,null,null,null,null,null,null,null,null,null,null,null,null,null,null,null,null,null,null,null,null,null,null,null,null,null,null,null,null,null,0]
[]
[]
[null,null,null,null,null,null,null,null,null,null,null,null,null,null,null,null,null,null,null,null,null,null,null,null,null,null,null,null,null,null,null,null,null,null,null,null,null,null,null,null,null,0]
[null,null,null,null,null,null,null,null,null,null,null,null,null,null,null,null,null,null,null,null,null,null,null,null,null,null,null,null,null,null,null,null,null,null,null,null,null,null,null,null,null,0]
[null,null,null,null,null,null,null,null,null,null,null,null,null,null,null,null,null,null,null,null,null,null,null,null,null,null,null,null,null,null,null,null,null,null,null,null,null,null,null,null,null,0]
{"$rows_left_out":11}