{"text_format":"1","workbook":"xlsx","n_sheets":7,"sheets":["Instructions","Renseignements Gén.à compléter ","Année 1 - à compléter","Année 2 - à compléter","Détail du calcul","Année 2 - à remplir","Poste"],"not_rendered":{"charts":0,"images":3,"macros":0,"external_links":0,"defined_names":934,"comments":5,"pivot_tables":0},"unopened":[],"bounds":{"document_bytes":16777216,"sheet_cells":100000,"rows_first":2000,"rows_last":500,"rows_between":2000,"halvings":0,"cell_chars":16384,"cell_head_chars":4096},"cells_cut":0,"cells_raw":0,"read":"whole","date_system":"1900"}

{"sheet":"Instructions","index":0,"n_rows":123,"n_cols":17,"rows_kept":123,"cut":false,"hidden":false,"merged":[[62,0,62,16],[0,5,0,16],[2,0,2,16],[3,0,3,16],[5,0,17,16],[23,0,55,16]]}
[null,null,null,null,null,"Financement des crédits d’impôt remboursables à la RS&DE"]
[null,null,null,null,null,null,null,null,null,null,null,null,null,null,null,null,"Exercice financier débutant du 1er juin 2014 au 1er décembre 2014"]
["DEMANDE DE GARANTIE / PRÊT"]
["Instructions"]
[]
["Veuillez remplir le présent formulaire électronique « Demande de garantie / Prêt », qui comprend les onglets                                          « Renseignements généraux – à compléter », « Année 1 – à compléter » et « Année 2 – à compléter », à l’aide du logiciel Microsoft Excel et le faire parvenir à Investissement Québec. Assurez-vous de répondre à toutes les questions et de fournir tous les renseignements. L’onglet  « Détail du calcul » vous permet de voir la façon dont les crédits d’impôt sont calculés à l’aide des renseignements soumis. Il ne nécessite aucune entrée de données. \n\nLa demande de financement couvre une période maximale de deux ans : deux formulaires ont donc été prévus à cet effet.  \n\nLes champs à remplir dans chaque onglet du formulaire électronique sont en jaune. Les lignes du formulaire font référence aux lignes de la déclaration de revenus des sociétés (T2 et CO-17). Les zones de calcul laissées en blanc sont automatisées grâce aux fonctionnalités de l’outil. Ces calculs sont fournis à titre indicatif seulement et n’engagent nullement Investissement Québec. Le montant minimal du prêt accordé est de 50 000 $ ou de 62 500 $ pour une demande de garantie de prêt.\n\nDes bulles d’information sont accessibles lorsque des précisions sont nécessaires. Un triangle rouge dans la cellule indique la présence d’une bulle d’information; il suffit d’en approcher le curseur pour l'afficher. Vous pouvez consulter le document T4088 – Guide pour le formulaire T661 Demande pour les dépenses de recherche scientifique et développement expérimental (RS&DE) sur le site de l’Agence du revenu du Canada (l’« ARC ») pour vous aider à remplir le formulaire. \n"]
[]
[]
[]
[]
[]
[]
[]
[]
[]
[]
[]
[]
[]
[]
{"$rows_left_out":104}
{"sheet":"Renseignements Gén.à compléter ","index":1,"n_rows":141,"n_cols":39,"rows_kept":141,"cut":false,"hidden":false,"merged":[[96,2,97,15],[140,14,140,15],[138,1,138,5],[138,6,138,9],[138,10,139,11],[138,12,139,13],[138,14,139,15],[134,1,134,5],[134,6,134,9],[134,10,135,11],[134,12,135,13],[134,14,135,15],[130,1,130,5],[130,6,130,9],[130,10,131,11],[130,12,131,13],[130,14,131,15],[126,1,126,5],[126,6,126,9],[126,10,127,11],[126,12,127,13],[126,14,127,15],[122,1,122,5],[122,6,122,9],[138,16,139,16],[139,1,139,5],[136,1,136,5],[136,6,136,9],[136,10,137,11],[136,12,137,13],[136,14,137,15],[136,16,137,16],[137,1,137,5],[137,7,137,9],[139,7,139,9],[134,16,135,16],[135,1,135,5],[132,1,132,5],[132,6,132,9],[132,10,133,11],[132,12,133,13],[132,14,133,15],[132,16,133,16],[133,1,133,5],[135,7,135,9],[130,16,131,16],[131,1,131,5],[131,7,131,9],[133,7,133,9],[128,1,128,5],[128,6,128,9],[128,10,129,11],[128,12,129,13],[128,14,129,15],[128,16,129,16],[129,1,129,5],[126,16,127,16],[127,1,127,5],[127,7,127,9],[129,7,129,9],[124,1,124,5],[124,6,124,9],[124,10,125,11],[124,12,125,13],[124,14,125,15],[124,16,125,16],[125,1,125,5],[122,10,123,11],[122,12,123,13],[122,14,123,15],[122,16,123,16],[123,1,123,5],[123,7,123,9],[125,7,125,9],[120,1,120,5],[120,6,120,9],[120,10,121,11],[120,12,121,13],[120,14,121,15],[120,16,121,16],[121,1,121,5],[117,1,117,16],[119,1,119,5],[119,6,119,9],[119,10,119,11],[119,12,119,13],[119,14,119,15],[121,7,121,9],[108,2,110,2],[108,3,110,12],[108,13,110,13],[108,14,110,15],[111,2,113,2],[111,3,113,12],[111,13,113,13],[111,14,113,15],[102,2,104,2],[102,3,104,12],[102,13,104,13],[102,14,104,15],[105,2,107,2],[105,3,107,12],[105,13,107,13],[105,14,107,15],[98,3,98,12],[98,14,98,15],[99,2,101,2],[99,3,101,12],[99,13,101,13],[99,14,101,15],[94,1,94,16],[90,6,90,8],[90,9,90,10],[90,11,90,13],[90,14,90,15],[91,2,92,2],[91,3,91,5],[91,6,91,8],[91,9,91,10],[91,11,91,13],[91,14,91,15],[89,2,90,2],[89,3,89,5],[89,6,89,8],[89,9,89,10],[89,11,89,13],[89,14,89,15],[90,3,90,5],[92,3,92,5],[92,6,92,8],[92,9,92,10],[92,11,92,13],[92,14,92,15],[87,2,88,2],[87,3,87,5],[87,6,87,8],[87,9,87,10],[87,11,87,13],[87,14,87,15],[88,3,88,5],[88,6,88,8],[88,9,88,10],[88,11,88,13],[88,14,88,15],[78,3,78,6],[81,3,81,6],[85,2,86,2],[85,3,86,5],[85,6,86,8],[85,9,86,10],[66,4,66,10],[67,4,67,10],[69,10,69,15],[71,3,71,7],[71,11,71,15],[73,1,73,16],[85,11,86,13],[85,14,86,15],[78,9,78,15],[81,9,81,15],[42,0,42,16],[47,1,47,10],[61,1,61,16],[62,0,62,16],[63,6,63,15],[65,4,65,10],[65,14,65,15],[37,1,37,5],[37,6,37,15],[40,6,40,8],[40,13,40,15],[41,6,41,8],[41,13,41,15],[25,6,25,15],[26,6,26,15],[27,6,27,15],[29,6,29,8],[29,13,29,15],[34,6,34,15],[20,1,20,5],[21,3,21,7],[21,11,21,15],[22,11,22,15],[23,11,23,15],[24,1,24,5],[18,1,18,5],[19,1,19,8],[19,9,19,15],[6,1,6,16],[8,8,8,15],[9,8,9,15],[10,5,11,15],[12,5,12,15],[13,5,13,15],[0,0,0,2],[2,0,2,16],[3,0,3,16],[4,1,4,7],[4,8,4,10],[4,12,4,14],[15,5,15,15],[16,5,16,15],[17,5,17,15]]}
[null,null,null,null,null,null,null,null,null,null,null,null,null,null,null,null,"Financement des crédits d’impôt remboursables à la RS&DE"]
[null,null,null,null,null,null,null,null,null,null,null,null,null,null,null,null,"Exercice financier débutant du 1er juin 2014 au 1er décembre 2014"]
["DEMANDE DE GARANTIE / PRÊT"]
["Renseignements généraux"]
[]
["1.0","Est-ce que l’entreprise a pris connaissance de l’onglet « Instructions » ?",null,null,null,null,null,null,null,null,null,null,null,null,null,null,null,null,0]
["1.1 ","IDENTIFICATION"]
[]
[null,"Raison sociale de l’entreprise requérante :"]
[null,"NEQ (numéro d’entreprise du Québec) :"]
[]
[null,"Adresse du siège social :"]
[]
[]
[]
[null,"Adresse du bureau principal "]
[null,"(si différente de celle du"]
[null,"siège social) :"]
[]
[null,"Personne avec qui Investissement Québec devra communiquer :"]
{"$rows_left_out":122}
{"sheet":"Année 1 - à compléter","index":2,"n_rows":189,"n_cols":27,"rows_kept":189,"cut":false,"hidden":false,"merged":[[133,18,133,20],[132,18,132,20],[20,7,20,9],[131,18,131,20],[21,3,21,9],[31,11,32,11],[34,11,35,11],[41,1,41,7],[76,1,78,11],[56,2,56,8],[57,2,57,8],[52,2,52,8],[51,2,51,8],[53,2,53,8],[62,2,62,8],[43,18,43,20],[55,2,55,8],[27,9,28,13],[22,9,24,13],[8,2,8,7],[9,2,9,8],[44,18,44,20],[45,18,45,20],[0,1,0,5],[4,2,4,8],[18,2,18,9]]}
[null,null,null,null,null,null,null,null,null,null,null,null,null,"Financement des crédits d’impôt remboursables à la RS&DE"]
[null,null,null,null,null,null,null,null,null,null,null,null,null,"Exercice financier débutant du 1er juin 2014 au 1er décembre 2014"]
[null,null,null,null,null,null,null,null,"DEMANDE DE GARANTIE / PRÊT"]
[null,null,null,null,null,null,null,null,"Calculs relatifs aux crédits d’impôt à financer (année 1)"]
[]
[null,null,null,null,null,null,null,null,null,null,null,null,null,null,null,null,null,null,null,null,"Taux applicables (Québec)",null,null,null,null,null,"Oui"]
[null,"2.0 ADMISSIBILITÉ AUX CRÉDITS D’IMPÔT REMBOURSABLES À LA RS&DE",null,null,null,null,null,null,null,null,null,null,null,null,null,null,null,{"$f":"IF(AND(MONTH(DATE(YEAR(RCalculDateDebut1),2,29)) =2,MONTH(RCalculDateDebut1)<3),TRUE,FALSE)","v":true},null,null,"aux dépenses admissibles nettes n’excédant pas 3 M$ ",null,null,null,null,null,"Non"]
[null,null,null,null,null,null,null,null,null,null,null,"(aaaa-mm-jj)",null,null,null,null,null,{"$f":"IF(AND(MONTH(DATE(YEAR(RCalculDateFin1),2,29)) =2,MONTH(RCalculDateFin1)>2),TRUE,FALSE)","v":false},null,null,"(en fonction des actifs indiqués dans les états financiers)"]
[null,null,"Exercice à financer  :",null,null,null,null,null,null,"Date de début :",null,null,{"$f":"\"   Attention :\"","v":"   Attention :"},null,null,null,null,{"$f":"RCalculDateFin1-RCalculDateDebut1","v":0},{"$f":"IF(OR(R7=TRUE,R8=TRUE),365,364)","v":365},null,"Dépenses admissibles nettes"]
[null,null," (débutant du 1er juin 2014 au 1er décembre 2014)",null,null,null,null,null,null,null,null,null,null,null,null,null,null,null,null,null,"(à titre indicatif)"]
[null,null,null,null,null,null,null,null,null,"Date de fin :",null,null,{"$f":"\"   ne représente pas 12 mois\"","v":"   ne représente pas 12 mois"},null,null,null,null,null,null,null,null,1,0.3]
[null,null,null,null,null,null,null,null,null,null,null,null,null,null,null,null,null,null,null,null,null,25000000,0.3]
[null,"2.1 ADMISSIBILITÉ AUX CRÉDITS D’IMPÔT REMBOURSABLES À LA RS&DE",null,null,null,null,null,null,null,null,null,null,null,null,null,null,null,null,null,null,null,50000000,0.3]
[null,null,null,null,null,null,null,null,null,null,null,null,null,null,null,null,null,null,null,null,null,55000000,0.26800000000000002]
[null,null,null,null,null,null,null,null,null,"L’entreprise requérante est une société sous contrôle canadien ",null,null,null,null,null,null,null,3,null,null,null,60000000,0.23599999999999999]
[null,null,null,null,null,null,null,null,null,"(aux fins de la Loi sur les impôts du Québec)",null,null,null,null,null,null,null,null,null,null,null,65000000,0.20399999999999999]
[null,null,null,null,null,null,null,null,null,null,null,null,null,null,null,null,null,null,null,null,null,70000000,0.17199999999999999]
[null,null,null,null,null,null,null,null,null,null,null,null,null,null,null,null,null,null,null,null,null,75000000,0.14000000000000001]
[null,null,"Actif aux états financiers (année précédant l’exercice financier) :",null,null,null,null,null,null,null,null,null," $",null,null,null,null,{"$f":"ROUND(0.375-((MAX(25000000,(MIN(50000000,L19)))-25000000)*0.2)/25000000,4)","v":0.17499999999999999},null,null,"* Le taux applicable aux dépenses admissibles excédant "]
[]
{"$rows_left_out":170}
{"sheet":"Année 2 - à compléter","index":3,"n_rows":189,"n_cols":26,"rows_kept":189,"cut":false,"hidden":false,"merged":[[0,1,0,5],[4,2,4,8],[8,2,8,7],[18,2,18,9],[9,2,9,8],[133,17,133,19],[132,17,132,19],[131,17,131,19],[20,7,20,9],[21,3,21,9],[22,9,24,13],[62,2,62,8],[76,1,78,11],[57,2,57,8],[31,11,32,11],[34,11,35,11],[51,2,51,8],[52,2,52,8],[53,2,53,8],[55,2,55,8],[56,2,56,8]]}
[null,null,null,null,null,null,null,null,null,null,null,null,null,"Financement des crédits d’impôt remboursables à la RS&DE"]
[null,null,null,null,null,null,null,null,null,null,null,null,null,"Exercice financier débutant du 1er juin 2014 au 1er décembre 2014"]
[null,null,null,null,null,null,null,null,"DEMANDE DE GARANTIE / PRÊT"]
[null,null,null,null,null,null,null,null,"Calculs relatifs aux crédits d’impôt à financer (année 2)"]
[]
[null,null,null,null,null,null,null,null,null,null,null,null,null,null,null,null,null,null,null,"Taux applicables (Québec)",null,null,null,null,null,"Oui"]
[null,"2.0 ADMISSIBILITÉ AUX CRÉDITS D’IMPÔT REMBOURSABLES À LA RS&DE",null,null,null,null,null,null,null,null,null,null,null,null,null,null,{"$f":"IF(AND(MONTH(DATE(YEAR(RCalculDateDebut1),2,29)) =2,MONTH(RCalculDateDebut1)<3),TRUE,FALSE)","v":true},null,null,"aux dépenses admissibles nettes n’excédant pas 3 M$ ",null,null,null,null,null,"Non"]
[null,null,null,null,null,null,null,null,null,null,null,"(aaaa-mm-jj)",null,null,null,null,{"$f":"IF(AND(MONTH(DATE(YEAR(RCalculDateFin1),2,29)) =2,MONTH(RCalculDateFin1)>2),TRUE,FALSE)","v":false},null,null,"(en fonction des actifs indiqués dans les états financiers)"]
[null,null,"Exercice à financer  :",null,null,null,null,null,null,"Date de début :",null,null,{"$f":"\"   Attention :\"","v":"   Attention :"},null,null,null,{"$f":"RCalculDateFin1-RCalculDateDebut1","v":0},{"$f":"IF(OR(Q7=TRUE,Q8=TRUE),365,364)","v":365},null,"Dépenses admissibles nettes"]
[null,null," (débutant du 1er juin 2014 au 1er décembre 2014)",null,null,null,null,null,null,null,null,null,null,null,null,null,null,null,null,"(à titre indicatif)"]
[null,null,null,null,null,null,null,null,null,"Date de fin :",null,null,{"$f":"\"   ne représente pas 12 mois\"","v":"   ne représente pas 12 mois"},null,null,null,null,null,null,null,1,0.3]
[null,null,null,null,null,null,null,null,null,null,null,null,null,null,null,null,null,null,null,null,25000000,0.3]
[null,"2.1 ADMISSIBILITÉ AUX CRÉDITS D’IMPÔT REMBOURSABLES À LA RS&DE",null,null,null,null,null,null,null,null,null,null,null,null,null,null,null,null,null,null,50000000,0.3]
[null,null,null,null,null,null,null,null,null,null,null,null,null,null,null,null,null,null,null,null,55000000,0.26800000000000002]
[null,null,null,null,null,null,null,null,null,"L’entreprise requérante est une société sous contrôle canadien ",null,null,null,null,null,null,3,null,null,null,60000000,0.23599999999999999]
[null,null,null,null,null,null,null,null,null,"(aux fins de la Loi sur les impôts du Québec)",null,null,null,null,null,null,null,null,null,null,65000000,0.20399999999999999]
[null,null,null,null,null,null,null,null,null,null,null,null,null,null,null,null,null,null,null,null,70000000,0.17199999999999999]
[null,null,null,null,null,null,null,null,null,null,null,null,null,null,null,null,null,null,null,null,75000000,0.14000000000000001]
[null,null,"Actif aux états financiers (année précédant l’exercice financier) :",null,null,null,null,null,null,null,null,null," $",null,null,null,{"$f":"ROUND(0.375-((MAX(25000000,(MIN(50000000,L19)))-25000000)*0.2)/25000000,4)","v":0.17499999999999999},null,null,"* Le taux applicable aux dépenses admissibles excédant "]
[]
{"$rows_left_out":170}
{"sheet":"Détail du calcul","index":4,"n_rows":144,"n_cols":27,"rows_kept":144,"cut":false,"hidden":false,"merged":[[31,14,32,14],[131,2,131,9],[121,2,121,10],[49,14,50,14],[65,2,65,8],[67,2,67,7],[122,2,122,7],[75,2,75,8],[117,2,118,10],[10,11,10,12],[11,2,11,9],[12,11,12,12],[22,11,22,12],[54,3,54,8],[51,3,51,8],[53,3,53,8],[24,11,24,12],[49,3,49,8],[49,9,50,9],[49,11,50,11],[50,3,50,7],[31,11,32,11],[0,1,0,5],[87,3,87,8],[89,3,89,8],[91,3,91,8],[44,3,44,8],[46,3,46,8],[6,2,6,9]]}
[null,null,null,null,null,null,null,null,null,null,null,null,null,null,null,"Financement des crédits d’impôt remboursables à la RS&DE"]
[null,null,null,null,null,null,null,null,null,null,null,null,null,null,null,"Exercice financier débutant du 1er juin 2014 au 1er décembre 2014"]
[null,null,null,null,null,null,null,null,"DEMANDE DE GARANTIE / PRÊT"]
[null,null,null,null,null,null,null,null,"Calculs relatifs aux crédits d’impôt RS&DE "]
[null,null,"Québec – Taux applicable pour le calcul des crédits d’impôt à la RS&DE "]
[]
[]
[]
[null,null,null,null,null,null,null,null,null,"Date de début : ",null,{"$f":"RCalculDateDebut1","v":"00:00:00"},null,null,{"$f":"'Année 2 - à compléter'!RCalculDateDebut1","v":"00:00:00"}]
[null,null,null,null,null,null,null,null,null,"Date de fin : ",null,{"$f":"RCalculDateFin1","v":"00:00:00"},null,null,{"$f":"'Année 2 - à compléter'!RCalculDateFin1","v":"00:00:00"}]
[]
[null,null,"Taux applicable aux dépenses admissibles n’excédant pas la limite de dépenses de 3 000 000 $ ",null,null,null,null,null,null,null,null,{"$f":"IF('Année 1 - à compléter'!R15=2,0.14,IF(OR('Année 1 - à compléter'!L19=\"\",'Année 1 - à compléter'!L19=0),0,IF(AND('Année 1 - à compléter'!L19>0,'Année 1 - à compléter'!R30>0,'Année 1 - à compléter'!S80),'Année 1 - à compléter'!R30,0)))","v":0},null,null,{"$f":"IF('Année 2 - à compléter'!Q15=2,0.14,IF(OR('Année 2 - à compléter'!L19=\"\",'Année 2 - à compléter'!L19=0),0,IF(AND('Année 2 - à compléter'!L19>0,'Année 2 - à compléter'!Q30>0,'Année 2 - à compléter'!R80),'Année 2 - à compléter'!Q30,0)))","v":0}]
[]
[null,null,null,null,null,null,null,null,null,"Taux applicable aux dépenses admissibles excédant la limite de dépense de 3 000 000 $ ",null,{"$f":"0.14","v":0.14000000000000001},null,null,{"$f":"0.14","v":0.14000000000000001}]
[]
[]
[null,null,"Fédéral – Calcul de la limite des dépenses donnant droit aux crédits d’impôt à la RS&DE bonifiés "]
[]
[null,null,null,"Maximum",null,null,null,null,null,null,null,{"$f":"800000*10","v":8000000},null," $",{"$f":"800000*10","v":8000000}]
[null,null,null,"Moins le plus élevé de :"]
{"$rows_left_out":125}
{"sheet":"Année 2 - à remplir","index":5,"n_rows":200,"n_cols":23,"rows_kept":200,"cut":false,"hidden":true,"merged":[[114,3,114,8],[116,3,116,7],[113,3,113,8],[115,11,116,11],[115,9,116,9],[181,2,181,7],[186,9,186,10],[115,3,115,8],[127,2,127,8],[129,2,129,7],[131,2,131,7],[133,2,133,8],[152,3,152,11],[151,3,151,11],[150,3,150,11],[180,2,180,10],[195,9,195,10],[195,11,195,14],[184,11,184,14],[185,11,185,14],[186,11,186,14],[193,9,193,10],[193,11,193,14],[190,2,190,9],[184,9,184,10],[185,9,185,10],[194,9,194,10],[194,11,194,14],[10,11,10,12],[20,7,20,9],[8,11,8,12],[19,11,19,12],[18,11,18,12],[20,11,20,12],[18,2,18,9],[8,2,8,7],[9,2,9,7],[59,11,59,12],[27,2,27,9],[0,7,0,15],[0,1,0,5],[2,0,2,16],[3,0,3,16],[4,2,4,8],[12,2,12,10],[7,11,7,12],[9,11,9,12],[42,11,43,12],[21,11,21,12],[48,11,48,12],[29,11,29,12],[25,11,25,12],[27,11,27,12],[129,18,129,20],[127,18,127,20],[128,18,128,20],[60,11,60,12],[61,11,61,12],[64,11,64,12],[122,15,123,15],[67,11,67,12],[115,15,116,15],[21,3,21,9],[58,11,58,12],[47,11,47,12],[26,11,26,12],[50,11,50,12],[57,11,57,12],[23,2,23,9],[28,11,28,12],[41,11,41,12],[54,11,54,12],[45,11,46,12],[44,11,44,12]]}
[null,null,null,null,null,null,null,"Financement des crédits d'impôt remboursables à la à la R-D"]
[]
["DEMANDE DE GARANTIE / PRÊT"]
["Calculs relatifs aux crédits d'impôt à financer (année 2)"]
[null,null,{"$f":"#REF!","v":{"$error":"#REF!"}},null,null,null,null,null,null,null,{"$f":"#REF!","v":{"$error":"#REF!"}},{"$f":"#REF!","v":{"$error":"#REF!"}},null,null,{"$f":"#REF!","v":{"$error":"#REF!"}},{"$f":"#REF!","v":{"$error":"#REF!"}}]
[null,null,null,null,null,null,null,null,null,null,{"$f":"IF(RNumeroConfirmationDemande<>\"\",\"Nº. Demande\",\"\")","v":{"$error":"#REF!"}},{"$f":"ANumeroConfirmationDemande","v":{"$error":"#REF!"}},null,null,{"$f":"IF(RDateTransmissionDemande<>\"\",\"transmis le\",\"\")","v":{"$error":"#REF!"}},{"$f":"ADateTransmissionDemande","v":{"$error":"#REF!"}},null,null,null,null,"Taux applicables (Québec)"]
[null,"ADMISSIBILITÉ AUX CRÉDITS D'IMPÔT À LA R-D REMBOURSABLES",null,null,null,null,null,null,null,null,null,null,null,null,null,null,null,{"$f":"IF(AND(MONTH(DATE(YEAR(RCalculDateDebut2),2,29)) =2,MONTH(RCalculDateDebut2)<3),TRUE,FALSE)","v":false},null,null,"aux dépenses admissibles nettes n'excédant pas 2 M$ "]
[null,null,null,null,null,null,null,null,null,null,null,"(aaaa-mm-jj)",null,null,null,null,null,{"$f":"IF(AND(MONTH(DATE(YEAR(RCalculDateFin2),2,29)) =2,MONTH(RCalculDateFin2)>2),TRUE,FALSE)","v":false},null,null,"(en fonction des actifs indiqués dans les états financiers)"]
[null,null,"Deuxième exercice à financer  :",null,null,null,null,null,null,"Date de début :",null,"2013-01-01",null,{"$f":"\"   Attention :\"","v":"   Attention :"},null,null,null,{"$f":"RCalculDateFin2-RCalculDateDebut2","v":364},{"$f":"IF(OR(R7=TRUE,R8=TRUE),365,364)","v":364},null,"Dépenses admissibles nettes"]
[null,null," (débutant après le 4 décembre 2006)",null,null,null,null,null,null,null,null,null,null,null,null,null,null,null,null,null,"(à titre indicatif )"]
[null,null,null,null,null,null,null,null,null,"Date de fin :",null,"2013-12-31",null,{"$f":"\"   ne représente pas 12 mois\"","v":"   ne représente pas 12 mois"},null,null,null,null,null,null,null,1,0.375]
[null,null,null,null,null,null,null,null,null,null,null,null,null,null,null,null,null,null,null,null,null,25000000,0.375]
[null,"2.1"," Admissibilité aux crédits d'impôt à la R-D remboursables (Québec)",null,null,null,null,null,null,null,null,null,null,null,null,null,null,null,null,null,null,50000000,0.375]
[null,null,null,null,null,null,null,null,null,null,null,null,null,null,null,null,null,null,null,null,null,55000000,0.33500000000000002]
[null,null,null,null,null,null,null,null,null,"L'entreprise requérante est une corporation à contrôle canadien.",null,null,null,null,null,null,null,1,null,null,null,60000000,0.29499999999999998]
[null,null,null,null,null,null,null,null,null,null,null,null,null,null,null,null,null,null,null,null,null,65000000,0.255]
[null,null,null,null,null,null,null,null,null,null,null,null,null,null,null,null,null,null,null,null,null,70000000,0.215]
[null,null,null,null,null,null,null,null,null,null,null,null,null,null,null,null,null,null,null,null,null,75000000,0.17499999999999999]
[null,null,"Actif aux états financiers (année précédant l'exercice financier) :",null,null,null,null,null,null,null,null,null,null," $",null,null,null,{"$f":"ROUND(0.375-((MAX(25000000,(MIN(50000000,L19)))-25000000)*0.2)/25000000,4)","v":0.17499999999999999}]
[]
{"$rows_left_out":181}
{"sheet":"Poste","index":6,"n_rows":7,"n_cols":1,"rows_kept":7,"cut":false,"hidden":true,"merged":[]}
[]
["Président"]
["Vice-président Finance"]
["Vice-président R&D"]
["Contrôleur"]
["Actionnaire"]
["Autres (Précisez)"]