{"text_format":"1","workbook":"xlsx","n_sheets":6,"sheets":["Instructions ","General information - To fill","Year 1 - To fill","Year 2 - To fill","Calculation Details","Title"],"not_rendered":{"charts":0,"images":3,"macros":0,"external_links":2,"defined_names":969,"comments":4,"pivot_tables":0},"unopened":[],"bounds":{"document_bytes":16777216,"sheet_cells":100000,"rows_first":2000,"rows_last":500,"rows_between":2000,"halvings":0,"cell_chars":16384,"cell_head_chars":4096},"cells_cut":0,"cells_raw":0,"read":"whole","date_system":"1900"}

{"sheet":"Instructions ","index":0,"n_rows":124,"n_cols":17,"rows_kept":124,"cut":false,"hidden":false,"merged":[[0,5,0,16],[2,0,2,16],[3,0,3,16],[63,0,63,16],[5,0,20,16],[25,0,60,16]]}
[null,null,null,null,null,"Financing of Refundable SR&ED Tax Credits"]
[null,null,null,null,null,null,null,null,null,null,null,null,null,null,null,null,"For fiscal year containing June 4, 2014"]
["LOAN / GUARANTEE APPLICATION"]
["Instructions"]
[]
["Complete the “General Information - To fill”, “Year 1 – to fill” and “Year 2 – to fill” tabs of this electronic “LOAN / GUARANTEE APPLICATION” form using Microsoft Excel and forward it to Investissement Québec. Be sure to answer all the questions and provide complete information. The “Calculation Details” tab provides the detailed calculation of your tax credits based on the information provided. No data entry is required in these tabs. \n\nThe application for financing can cover a maximum of two years; therefore, two forms have been provided to cover the two-year period.  \n\nThe data entry fields in each tab of the electronic form are in yellow. The lines on the form correspond to the lines on the company's T2 and CO-17 income tax return. The calculation zones left in white are automated and will be completed by the system. These calculations are provided as examples only and are in no way binding on Investissement Québec. The minimum loan granted is $50,000. The minimum loan guarantee granted is $62,500. \n\nTool tips have been provided where it was determined that explanations may be helpful in completing the form. They are identified by a red triangle in the top right corner of the cell . Move your mouse over the cell to view the tip. The T4088 Scientific Research and Experimental Development (SR&ED) Expenditures Claim - Guide to Form T661 is available on the Canada Revenue Agency (CRA)  website to assist you in completing the form. \n\n"]
[]
[]
[]
[]
[]
[]
[]
[]
[]
[]
[]
[]
[]
[]
{"$rows_left_out":105}
{"sheet":"General information - To fill","index":1,"n_rows":141,"n_cols":19,"rows_kept":141,"cut":false,"hidden":false,"merged":[[69,8,69,15],[78,9,78,15],[81,9,81,15],[133,7,133,9],[135,7,135,9],[137,7,137,9],[126,6,126,9],[0,0,0,2],[15,5,15,15],[2,0,2,16],[3,0,3,16],[8,8,8,15],[47,1,47,10],[10,5,11,15],[6,1,6,16],[27,6,27,15],[29,6,29,8],[13,5,13,15],[24,1,24,5],[25,6,25,15],[21,11,21,15],[22,11,22,15],[4,1,4,7],[40,13,40,15],[20,1,20,5],[12,5,12,15],[4,8,4,10],[16,5,16,15],[34,6,34,15],[26,6,26,15],[9,8,9,15],[4,12,4,14],[17,5,17,15],[29,13,29,15],[18,1,18,5],[23,11,23,15],[19,5,19,15],[19,1,19,2],[21,5,21,8],[37,1,37,5],[37,6,37,15],[85,9,86,10],[40,6,40,8],[71,3,71,7],[85,14,86,15],[67,4,67,10],[61,1,61,16],[41,6,41,8],[41,13,41,15],[65,4,65,10],[65,14,65,15],[66,4,66,10],[42,0,42,16],[85,2,86,2],[85,3,86,5],[85,6,86,8],[73,1,73,16],[78,3,78,6],[81,3,81,6],[85,11,86,13],[62,0,62,16],[71,10,71,15],[63,4,63,15],[91,2,92,2],[94,1,94,16],[98,14,98,15],[124,12,125,13],[87,9,87,10],[87,3,87,5],[87,11,87,13],[87,6,87,8],[89,11,89,13],[88,14,88,15],[89,2,90,2],[90,14,90,15],[89,14,89,15],[119,6,119,9],[91,3,91,5],[92,6,92,8],[92,3,92,5],[91,6,91,8],[92,11,92,13],[92,9,92,10],[124,6,124,9],[125,1,125,5],[124,14,125,15],[121,7,121,9],[91,11,91,13],[88,9,88,10],[99,13,101,13],[102,13,104,13],[99,14,101,15],[102,14,104,15],[105,13,107,13],[108,13,110,13],[111,13,113,13],[105,14,107,15],[91,9,91,10],[98,3,98,12],[88,11,88,13],[90,9,90,10],[88,3,88,5],[96,2,97,15],[87,2,88,2],[89,9,89,10],[92,14,92,15],[89,6,89,8],[91,14,91,15],[90,3,90,5],[88,6,88,8],[89,3,89,5],[136,16,137,16],[135,1,135,5],[132,1,132,5],[131,1,131,5],[126,1,126,5],[124,1,124,5],[123,1,123,5],[128,6,128,9],[130,6,130,9],[132,6,132,9],[134,6,134,9],[126,12,127,13],[124,10,125,11],[128,14,129,15],[133,1,133,5],[127,1,127,5],[132,12,133,13],[130,14,131,15],[136,1,136,5],[137,1,137,5],[136,6,136,9],[136,10,137,11],[126,10,127,11],[130,10,131,11],[87,14,87,15],[90,11,90,13],[90,6,90,8],[108,14,110,15],[111,14,113,15],[138,16,139,16],[120,16,121,16],[122,16,123,16],[124,16,125,16],[126,16,127,16],[128,16,129,16],[130,16,131,16],[132,16,133,16],[122,10,123,11],[132,10,133,11],[122,14,123,15],[120,14,121,15],[138,12,139,13],[134,12,135,13],[122,12,123,13],[136,14,137,15],[134,16,135,16],[134,14,135,15],[134,10,135,11],[140,14,140,15],[138,14,139,15],[136,12,137,13],[134,1,134,5],[130,1,130,5],[129,1,129,5],[128,1,128,5],[122,1,122,5],[121,1,121,5],[138,10,139,11],[138,1,138,5],[138,6,138,9],[139,1,139,5],[132,14,133,15],[126,14,127,15],[128,10,129,11],[130,12,131,13],[128,12,129,13],[139,7,139,9],[123,7,123,9],[125,7,125,9],[127,7,127,9],[129,7,129,9],[131,7,131,9],[119,1,119,5],[120,6,120,9],[122,6,122,9],[119,10,119,11],[99,2,101,2],[99,3,101,12],[102,2,104,2],[102,3,104,12],[105,2,107,2],[108,2,110,2],[111,2,113,2],[105,3,107,12],[108,3,110,12],[111,3,113,12],[120,10,121,11],[120,12,121,13],[120,1,120,5],[119,12,119,13],[117,1,117,16],[119,14,119,15]]}
[null,null,null,null,null,null,null,null,null,null,null,null,null,null,null,null,"Financing of Refundable SR&ED Tax Credits"]
[null,null,null,null,null,null,null,null,null,null,null,null,null,null,null,null,"For fiscal year containing June 4, 2014"]
["LOAN / GUARANTEE APPLICATION"]
["General information"]
[null,{"$f":"I9","v":0},null,null,null,null,null,null,"Nº. Organisation",null,null,null,"Nº. Dossier"]
["1.0","Has the company read and understood the “Instructions” tab?"]
["1.1 ","IDENTIFICATION",null,null,null,null,null,null,null,null,null,null,null,null,null,null,null,null,"00:00:00"]
[]
[null,"Name of company submitting the application:"]
[null,"NEQ (Québec enterprise number):"]
[]
[null,"Address of head office:"]
[]
[]
[]
[null,"Address of the main office "]
[null,"(If different from head office)"]
[]
[]
[null,"Contact person"]
{"$rows_left_out":122}
{"sheet":"Year 1 - To fill","index":2,"n_rows":189,"n_cols":28,"rows_kept":189,"cut":false,"hidden":false,"merged":[[20,7,20,9],[21,3,21,9],[18,2,18,9],[22,9,24,13],[0,7,0,13],[8,2,8,7],[9,2,9,7],[0,1,0,5],[2,0,2,13],[3,0,3,13],[4,2,4,8],[131,18,131,20],[133,18,133,20],[132,18,132,20],[31,11,32,11],[34,11,35,11],[76,1,76,11],[55,2,55,8],[62,2,62,8],[51,2,51,8],[53,2,53,8],[56,2,56,8],[57,2,57,8],[52,2,52,8],[41,1,41,13]]}
[null,null,null,null,null,null,null,"Financing of Refundable SR&ED Tax Credits"]
[null,null,null,null,null,null,null,null,null,null,null,null,null,"For fiscal year containing June 4th, 2014"]
["LOAN / GUARANTEE APPLICATION"]
["Calculations for tax credits to be financed (year 1)"]
[null,null,{"$f":"'General information - To fill'!I9","v":0},null,null,null,null,null,null,null,{"$f":"'General information - To fill'!I5","v":"Nº. Organisation"},{"$f":"'General information - To fill'!L5","v":0},null,{"$f":"'General information - To fill'!M5","v":"Nº. Dossier"}]
[null,null,null,null,null,null,null,null,null,null,{"$f":"IF(RNumeroConfirmationDemande<>\"\",\"Nº. Demande\",\"\")","v":""},{"$f":"ANumeroConfirmationDemande","v":0},null,{"$f":"IF(RDateTransmissionDemande<>\"\",\"transmis le\",\"\")","v":""},null,null,null,null,null,null,"Québec applicable rate",null,null,null,null,null,null,"Yes"]
[null,"2.0 ELIGIBILITY FOR REFUNDABLE SR&ED TAX CREDITS",null,null,null,null,null,null,null,null,null,null,null,null,null,null,null,{"$f":"IF(AND(MONTH(DATE(YEAR(RCalculDateDebut1),2,29)) =2,MONTH(RCalculDateDebut1)<3),TRUE,FALSE)","v":true},null,null,"net eligible expenditures under $3,000,000 ",null,null,null,null,null,null,"No"]
[null,null,null,null,null,null,null,null,null,null,null,"(yyyy-mm-dd)",null,null,null,null,null,{"$f":"IF(AND(MONTH(DATE(YEAR(RCalculDateFin1),2,29)) =2,MONTH(RCalculDateFin1)>2),TRUE,FALSE)","v":false},null,null,"(based on assets as per financial statements)"]
[null,null,"Fiscal year to be financed:",null,null,null,null,null,null,"Start date :",null,null,{"$f":"\"   Warming :\"","v":"   Warming :"},null,null,null,null,{"$f":"RCalculDateFin1-RCalculDateDebut1","v":0},{"$f":"IF(OR(R7=TRUE,R8=TRUE),365,364)","v":365},null,"Net eligible expenditures"]
[null,null," (starting after December 31, 2012)",null,null,null,null,null,null,null,null,null,null,null,null,null,null,null,null,null,"(example)",null,"Before June 4th, 2014","After June 4th,2014"]
[null,null,null,null,null,null,null,null,null,"End date",null,null,{"$f":"\"   doesn't represent 12 months\"","v":"   doesn't represent 12 months"},null,null,null,null,null,null,null,null,1,0.375,0.3]
[null,null,null,null,null,null,null,null,null,null,null,null,null,null,null,null,null,null,null,null,null,25000000,0.375,0.3]
[null,"2.1 ELIGIBILITY FOR REFUNDABLE SR&ED TAX CREDITS",null,null,null,null,null,null,null,null,null,null,null,null,null,null,null,null,null,null,null,50000000,0.375,0.3]
[null,null,null,null,null,null,null,null,null,null,null,null,null,null,null,null,null,null,null,null,null,55000000,0.33500000000000002,0.26800000000000002]
[null,null,null,null,null,null,null,null,null,"The company submitting the application is a Canadian corporation ",null,null,null,null,null,null,null,3,null,null,null,60000000,0.29499999999999998,0.23599999999999999]
[null,null,null,null,null,null,null,null,null,"(as defined by the Québec Tax Act)",null,null,null,null,null,null,null,null,null,null,null,65000000,0.255,0.20399999999999999]
[null,null,null,null,null,null,null,null,null,null,null,null,null,null,null,null,null,null,null,null,null,70000000,0.215,0.17199999999999999]
[null,null,null,null,null,null,null,null,null,null,null,null,null,null,null,null,null,null,null,null,null,75000000,0.17499999999999999,0.14000000000000001]
[null,null,"Assets as per financial statements (year preceding the fiscal year):",null,null,null,null,null,null,null,"$",null,null,null,null,null,null,{"$f":"ROUND(0.375-((MAX(25000000,(MIN(50000000,L19)))-25000000)*0.2)/25000000,4)","v":0.17499999999999999},null,null,"* The rate for eligible expenditures exceeding the limit of $ 3,000,000 is between 14% and 17.5%"]
[]
{"$rows_left_out":170}
{"sheet":"Year 2 - To fill","index":3,"n_rows":189,"n_cols":28,"rows_kept":189,"cut":false,"hidden":false,"merged":[[22,9,24,13],[0,1,0,5],[0,7,0,13],[4,2,4,8],[2,0,2,13],[3,0,3,13],[8,2,8,7],[9,2,9,7],[18,2,18,9],[20,7,20,9],[21,3,21,9],[132,18,132,20],[133,18,133,20],[56,2,56,8],[31,11,32,11],[34,11,35,11],[41,1,41,13],[51,2,51,8],[52,2,52,8],[55,2,55,8],[53,2,53,8],[57,2,57,8],[62,2,62,8],[76,1,76,11],[131,18,131,20]]}
[null,null,null,null,null,null,null,"Financing of Refundable SR&ED Tax Credits"]
[null,null,null,null,null,null,null,null,null,null,null,null,null,"For fiscal year containing June 4th, 2014"]
["LOAN / GUARANTEE APPLICATION"]
["Calculations for tax credits to be financed (year 2)"]
[null,null,{"$f":"'General information - To fill'!I9","v":0},null,null,null,null,null,null,null,{"$f":"'General information - To fill'!I5","v":"Nº. Organisation"},{"$f":"'General information - To fill'!L5","v":0},null,{"$f":"'General information - To fill'!M5","v":"Nº. Dossier"}]
[null,null,null,null,null,null,null,null,null,null,{"$f":"IF(RNumeroConfirmationDemande<>\"\",\"Nº. Demande\",\"\")","v":""},{"$f":"ANumeroConfirmationDemande","v":0},null,{"$f":"IF(RDateTransmissionDemande<>\"\",\"transmis le\",\"\")","v":""},null,null,null,null,null,null,"Québec applicable rate",null,null,null,null,null,null,"Yes"]
[null,"2.0 ELIGIBILITY FOR REFUNDABLE SR&ED TAX CREDITS",null,null,null,null,null,null,null,null,null,null,null,null,null,null,null,{"$f":"IF(AND(MONTH(DATE(YEAR(RCalculDateDebut1),2,29)) =2,MONTH(RCalculDateDebut1)<3),TRUE,FALSE)","v":true},null,null,"net eligible expenditures under $3,000,000 ",null,null,null,null,null,null,"No"]
[null,null,null,null,null,null,null,null,null,null,null,"(yyyy-mm-dd)",null,null,null,null,null,{"$f":"IF(AND(MONTH(DATE(YEAR(RCalculDateFin1),2,29)) =2,MONTH(RCalculDateFin1)>2),TRUE,FALSE)","v":false},null,null,"(based on assets as per financial statements)"]
[null,null,"Fiscal year to be financed:",null,null,null,null,null,null,"Start date :",null,null,{"$f":"\"   Warning :\"","v":"   Warning :"},null,null,null,null,{"$f":"RCalculDateFin1-RCalculDateDebut1","v":0},{"$f":"IF(OR(R7=TRUE,R8=TRUE),365,364)","v":365},null,"Net eligible expenditures"]
[null,null," (starting after December 31, 2012)",null,null,null,null,null,null,null,null,null,null,null,null,null,null,null,null,null,"(example)",null,"Before June 4th, 2014","After June 4th,2014"]
[null,null,null,null,null,null,null,null,null,"End date",null,null,{"$f":"\"   does not represent 12 months\"","v":"   does not represent 12 months"},null,null,null,null,null,null,null,null,1,0.375,0.3]
[null,null,null,null,null,null,null,null,null,null,null,null,null,null,null,null,null,null,null,null,null,25000000,0.375,0.3]
[null,"2.1 ELIGIBILITY FOR REFUNDABLE SR&ED TAX CREDITS",null,null,null,null,null,null,null,null,null,null,null,null,null,null,null,null,null,null,null,50000000,0.375,0.3]
[null,null,null,null,null,null,null,null,null,null,null,null,null,null,null,null,null,null,null,null,null,55000000,0.33500000000000002,0.26800000000000002]
[null,null,null,null,null,null,null,null,null,"The company submitting the application is a Canadian corporation ",null,null,null,null,null,null,null,3,null,null,null,60000000,0.29499999999999998,0.23599999999999999]
[null,null,null,null,null,null,null,null,null,"(as defined by the Québec Tax Act)",null,null,null,null,null,null,null,null,null,null,null,65000000,0.255,0.20399999999999999]
[null,null,null,null,null,null,null,null,null,null,null,null,null,null,null,null,null,null,null,null,null,70000000,0.215,0.17199999999999999]
[null,null,null,null,null,null,null,null,null,null,null,null,null,null,null,null,null,null,null,null,null,75000000,0.17499999999999999,0.14000000000000001]
[null,null,"Assets as per financial statements (year preceding the fiscal year):",null,null,null,null,null,null,null,"$",null,null,null,null,null,null,{"$f":"ROUND(0.375-((MAX(25000000,(MIN(50000000,L19)))-25000000)*0.2)/25000000,4)","v":0.17499999999999999},null,null,"* The rate for eligible expenditures exceeding the limit of $ 3,000,000 is between 14% and 17.5%"]
[]
{"$rows_left_out":170}
{"sheet":"Calculation Details","index":4,"n_rows":146,"n_cols":27,"rows_kept":146,"cut":false,"hidden":false,"merged":[[0,8,0,15],[35,14,36,14],[89,3,89,8],[91,3,91,8],[48,3,48,8],[55,3,55,8],[57,3,57,8],[28,11,28,12],[53,3,53,8],[53,9,54,9],[53,11,54,11],[54,3,54,7],[35,11,36,11],[6,2,6,9],[10,11,10,12],[11,2,11,9],[53,14,54,14],[119,2,119,10],[69,2,69,8],[71,2,71,7],[124,2,124,7],[78,2,78,8],[12,11,12,12],[26,11,26,12],[58,3,58,8],[93,3,93,8],[133,2,133,9],[123,2,123,10]]}
[" ",null,null,null,null,null,null,null,"Financing of Refundable SR&ED Tax Credits"]
[null,null,null,null,null,null,null,null,null,null,null,null,null,null,null,"For fiscal year containing June 4th, 2014"]
[null,null,null,null,null,null,null,null,"LOAN / GUARANTEE APPLICATION"]
[null,null,"For use by Investissement Québec",null,null,null,null,null,"Calculations of SR&ED tax credits "]
[null,null,"Québec - Applicable rates for the calculation of SR&ED tax credits ",null,null,null,null,null,null,null,null,null,null,null,null,null,null,null,"ANNÉE 1"]
[]
[null,null,"Applicable rate for calculating SR&ED tax credits on eligible expenditures (Québec):",null,null,null,null,null,null,null,null,null,null,null,null,null,null,null,"Split year 12-13"]
[null,null,null,null,null,null,null,null,null,null,null,null,null,null,null,null,null,null,"2014-06-04"]
[null,null,null,null,null,null,null,null,null,"Start date:",null,{"$f":"RCalculDateDebut1","v":"00:00:00"},null,null,{"$f":"'Year 2 - To fill'!RCalculDateDebut1","v":"00:00:00"},null,null,null,"Jours 2012","Jours 2013"]
[null,null,null,null,null,null,null,null,null,"End date:",null,{"$f":"RCalculDateFin1","v":"00:00:00"},null,null,{"$f":"'Year 2 - To fill'!RCalculDateFin1","v":"00:00:00"},null,null,null,{"$f":"S8-RCalculDateDebut1+1","v":41795},{"$f":"RCalculDateFin1-'Calculation Details'!S8","v":-41794}]
[]
[null,null,"Applicable rate for eligible expenditures not exceeding the expenditure limit of $3,000,000",null,null,null,null,null,null,null,null,{"$f":"V22","v":0},null,null,{"$f":"V42","v":0}]
[]
[null,null,null,null,null,null,null,null,null,"Applicable rate for eligible expenditures exceeding the expenditure limit of $3,000,000",null,{"$f":"T22","v":0.17499999999999999},null,null,{"$f":"T42","v":0.17499999999999999}]
[]
[]
[null,null,"Federal - Calculation of expenditure limit  for  enhanced refundable SR&ED tax credits: "]
[null,null,null,null,null,null,null,null,null,null,null,null,null,null,null,null,null,null,"Avant 06.04.2014",{"$f":"IF((RCalculDateFin1<DATE(2014,6,1)),0.175,0)","v":0.17499999999999999},"Avant 06.04.2014",{"$f":"IF((RCalculDateFin1<DATE(2014,6,1)),'Calculation Details'!W18,0)","v":0},{"$f":"IF(RONindicateurCorporationControlCanadienQuebec1=2,0.175,IF(OR(RmontantEtatFinancierQuebec1=\"\",RmontantEtatFinancierQuebec1=0),0,IF(AND(RmontantEtatFinancierQuebec1>0,'Year 1 - To fill'!R30>0,'Year 1 - To fill'!SaisiTerminer),'Year 1 - To fill'!R30,0)))","v":0}]
[null,null,null,null,null,null,null,null,null,null,null,null,null,null,null,null,null,null,"Entre",{"$f":"IF(AND(RCalculDateDebut1>=DATE(2013,7,1),RCalculDateDebut1<DATE(2014,6,1)),0.175*S10/365+0.14*T10/365,0)","v":0},"Entre",{"$f":"IF(AND(RCalculDateDebut1>=DATE(2013,7,1),RCalculDateDebut1<DATE(2014,6,1)),'Calculation Details'!W19,0)","v":0},{"$f":"IF(RONindicateurCorporationControlCanadienQuebec1=2,(0.175*S10/365+0.14*T10/365),IF(OR(RmontantEtatFinancierQuebec1=\"\",RmontantEtatFinancierQuebec1=0),0,IF(AND(RmontantEtatFinancierQuebec1>0,'Year 1 - To fill'!T30>0,'Year 1 - To fill'!SaisiTerminer),'Year 1 - To fill'!T30,0)))","v":0}]
[null,null,null,null,null,null,null,null,null,null,null,null,null,null,null,null,null,null,"Apres",{"$f":"IF(RCalculDateDebut1>=DATE(2014,6,1),0.14,0)","v":0},"Apres",{"$f":"IF(RCalculDateDebut1>=DATE(2014,6,1),W20,0)","v":0},{"$f":"IF(RONindicateurCorporationControlCanadienQuebec1=2,0.14,IF(OR(RmontantEtatFinancierQuebec1=\"\",RmontantEtatFinancierQuebec1=0),0,IF(AND(RmontantEtatFinancierQuebec1>0,'Year 1 - To fill'!S30>0,'Year 1 - To fill'!SaisiTerminer),'Year 1 - To fill'!S30,0)))","v":0}]
{"$rows_left_out":127}
{"sheet":"Title","index":5,"n_rows":7,"n_cols":1,"rows_kept":7,"cut":false,"hidden":true,"merged":[]}
[]
["President"]
["Vice-president of finance"]
["Vice-president of R&D"]
["Controller"]
["Shareholder"]
["Other (specify)"]