{"text_format":"1","workbook":"xlsx","n_sheets":6,"sheets":["Instructions ","General information - To fill","Year 1 - To fill","Year 2 - To fill","Calculation Details","Title"],"not_rendered":{"charts":0,"images":2,"macros":0,"external_links":2,"defined_names":971,"comments":4,"pivot_tables":0},"unopened":[],"bounds":{"document_bytes":16777216,"sheet_cells":100000,"rows_first":2000,"rows_last":500,"rows_between":2000,"halvings":0,"cell_chars":16384,"cell_head_chars":4096},"cells_cut":0,"cells_raw":0,"read":"whole","date_system":"1900"}

{"sheet":"Instructions ","index":0,"n_rows":114,"n_cols":18,"rows_kept":114,"cut":false,"hidden":false,"merged":[[91,0,91,3],[2,0,2,3],[3,0,3,3],[5,0,5,3],[11,0,11,3],[13,0,13,3],[14,0,14,3],[15,0,15,3],[19,0,19,3],[85,0,85,3],[12,0,12,3]]}
[null,null,null,"Financing of Refundable SR&ED Tax Credits"]
[null,null,null,"Fiscal year ending after March 18, 2019"]
["LOAN / GUARANTEE APPLICATION"]
["Instructions"]
[]
["Fill in the “General Information - To fill”, “Year 1 – to fill” and “Year 2 – to fill” tabs of the “LOAN / GUARANTEE APPLICATION” forward it to Investissement Québec. Be sure to answer all questions and provide complete information. The “Calculation Details” tab provides the detailed calculation of your tax credits based on the information provided. No data entry is required in this tab. \n\nThe application for financing can cover a maximum of two years; therefore, two tabs have been provided to cover this period.  An application covering a two year period is subject to a separate financing operation for each fiscal year.\n\nThe fields to be completed in each tab are indicated in yellow. The lines on the form correspond to the lines on the company's T2 and CO-17 income tax return. The calculation zones (left in white) are automated.  These calculations are provided for illustration purposes only and are in no way binding on Investissement Québec. The minimum amount per financing operation is $50,000, whether in the form of a loan or a loan guarantee.\n\nTooltips are available where further clarification may be required. A red triangle in the top right corner of the cell indicates the presence of a tooltip; simply move the cursor closer to it to display it."]
[]
[]
[]
[]
[]
["The T4088 Scientific Research and Experimental Development (SR&ED) Expenditures Claim - Guide to Form T661 is available \non the Canada Revenue Agency (CRA)  website to assist you in completing the form.\n\nIf you expect to apply for a second tax credit regarding the knowledge-based economy or print media during the course of your project, you can also complete the  \"Loan / Guarantee Application – Financing of refundable tax credits regarding : – the knowledge-based economy – print media companies\" form.\n"]
["Additional required documentation\n\nThe following additional documents are required to review your application; you must send them to the Investissement Québec Regional Office nearest you:\n\nA)  If you are a first-time filer for SR&ED tax credits you must obtain an opinion on the eligibility of your projects. (See: Preclaim \n     Project Review (PCPR) under Services offered on the CRA website at www.cra-arc.gc.ca/txcrdt/sred-rsde/menu-eng.html);\n\nB)  A duly completed and signed \"Declarations and Consents\" form and ESG Questionnaire that you can obtain from Investissement Québec;"]
["C)  A description of the scientific content of each SR&ED project (this description should supplement Section 1.5 of the “General\n     Information” tab) including:\n     1)  The title and main scientific or technological objectives of the SR&ED project;\n     2)  The timetable for completing the project (main steps/activities and corresponding levels of advancement);\n     3)  The nature of the scientific or technological uncertainties that the project aims to resolve – issues that could not be\n           resolved using standard practice;\n     4)  The contribution to technological advancements achieved as a result of the work (type of product or process) and the \n           impact on your company’s and current industry practices;\n     5)  An explanation of the scientific and technological content of the project to overcome the scientific and technological \n          uncertainties;\n     6)  The names and qualifications (job titles, expertise or experience) of the personnel involved in the SR&ED project and the\n          name of the scientist or technician responsible for the project with a copy of his/her résumé;\n\nD) The business plan or executive summary, if available, containing a presentation of the company and its team, target clientele, marketing \n     strategies, products, markets, competitors, etc.; \n\nE) The company's most recent annual financial statements (otherwise the company's opening balance sheet) and the most recent internal financial \n     statements available together with the corresponding aged accounts receivable and accounts payable listings of that date\n\nF)  Projected income statements and monthly cash flow budgets for the current and following fiscal years;"]
["G)  A copy of confirmations of government and non-government assistance (grants) related to the project, if applicable;\n\nH)  A complete copy of the last three (3) provincial and federal income tax returns and the related notices of assessment;\n\nI)  Written confirmation that amounts due to government authorities (DAS, GST, QST, taxes, etc.) have been paid;"]
["J)  A copy of all correspondence with Revenu Québec (RQ) or Canada Revenue Agency pertaining to the project;\n\nL)  Any other document that may facilitate the review of this application.\n\nAdditional required document for loan guarantee application\n\nIn addition to the documents listed above, the \"Declaration of the Lender\" form, obtained from Investissement Québec, and required for the review of your application, must be sent to the lender, who will proceed to fill it out. This completed form must then be forwarded to Investissement Québec.\n"]
[]
[]
[]
["Investissement Québec Regional Offices"]
{"$rows_left_out":95}
{"sheet":"General information - To fill","index":1,"n_rows":141,"n_cols":19,"rows_kept":141,"cut":false,"hidden":false,"merged":[[72,10,72,15],[133,7,133,9],[135,7,135,9],[137,7,137,9],[126,6,126,9],[0,0,0,2],[15,5,15,15],[2,0,2,16],[3,0,3,16],[8,8,8,15],[47,1,47,10],[10,5,11,15],[6,1,6,16],[27,6,27,15],[29,6,29,8],[13,5,13,15],[24,1,24,5],[25,6,25,15],[21,11,21,15],[22,11,22,15],[4,1,4,7],[40,13,40,15],[20,1,20,5],[12,5,12,15],[16,5,16,15],[34,6,34,15],[26,6,26,15],[9,8,9,15],[4,12,4,14],[17,5,17,15],[29,13,29,15],[18,1,18,5],[23,11,23,15],[19,5,19,15],[19,1,19,2],[4,8,4,10],[5,9,5,11],[37,1,37,5],[37,6,37,15],[85,9,86,10],[40,6,40,8],[71,3,71,7],[85,14,86,15],[67,4,67,10],[61,1,61,16],[41,6,41,8],[41,13,41,15],[65,4,65,10],[65,14,65,15],[66,4,66,10],[42,0,42,16],[85,2,86,2],[85,3,86,5],[85,6,86,8],[73,1,73,16],[78,3,78,6],[81,3,81,6],[85,11,86,13],[62,0,62,16],[71,10,71,15],[78,9,78,15],[91,2,92,2],[94,1,94,16],[98,14,98,15],[124,12,125,13],[87,9,87,10],[87,3,87,5],[87,11,87,13],[87,6,87,8],[89,11,89,13],[88,14,88,15],[89,2,90,2],[90,14,90,15],[89,14,89,15],[119,6,119,9],[91,3,91,5],[92,6,92,8],[92,3,92,5],[91,6,91,8],[92,11,92,13],[92,9,92,10],[124,6,124,9],[125,1,125,5],[124,14,125,15],[121,7,121,9],[91,11,91,13],[88,9,88,10],[99,13,101,13],[102,13,104,13],[99,14,101,15],[102,14,104,15],[105,13,107,13],[108,13,110,13],[111,13,113,13],[105,14,107,15],[91,9,91,10],[98,3,98,12],[88,11,88,13],[90,9,90,10],[88,3,88,5],[96,2,97,15],[87,2,88,2],[89,9,89,10],[92,14,92,15],[89,6,89,8],[91,14,91,15],[90,3,90,5],[88,6,88,8],[89,3,89,5],[136,16,137,16],[135,1,135,5],[132,1,132,5],[131,1,131,5],[126,1,126,5],[124,1,124,5],[123,1,123,5],[128,6,128,9],[130,6,130,9],[132,6,132,9],[134,6,134,9],[126,12,127,13],[124,10,125,11],[128,14,129,15],[133,1,133,5],[127,1,127,5],[132,12,133,13],[130,14,131,15],[136,1,136,5],[137,1,137,5],[136,6,136,9],[136,10,137,11],[126,10,127,11],[130,10,131,11],[87,14,87,15],[90,11,90,13],[90,6,90,8],[108,14,110,15],[111,14,113,15],[138,16,139,16],[120,16,121,16],[122,16,123,16],[124,16,125,16],[126,16,127,16],[128,16,129,16],[130,16,131,16],[132,16,133,16],[122,10,123,11],[132,10,133,11],[122,14,123,15],[120,14,121,15],[138,12,139,13],[134,12,135,13],[122,12,123,13],[136,14,137,15],[134,16,135,16],[134,14,135,15],[134,10,135,11],[140,14,140,15],[138,14,139,15],[136,12,137,13],[134,1,134,5],[130,1,130,5],[129,1,129,5],[128,1,128,5],[122,1,122,5],[121,1,121,5],[138,10,139,11],[138,1,138,5],[138,6,138,9],[139,1,139,5],[132,14,133,15],[126,14,127,15],[128,10,129,11],[130,12,131,13],[128,12,129,13],[139,7,139,9],[123,7,123,9],[125,7,125,9],[127,7,127,9],[129,7,129,9],[131,7,131,9],[81,9,81,15],[69,8,69,15],[63,4,63,15],[21,5,21,8],[119,1,119,5],[120,6,120,9],[122,6,122,9],[119,10,119,11],[99,2,101,2],[99,3,101,12],[102,2,104,2],[102,3,104,12],[105,2,107,2],[108,2,110,2],[111,2,113,2],[105,3,107,12],[108,3,110,12],[111,3,113,12],[120,10,121,11],[120,12,121,13],[120,1,120,5],[119,12,119,13],[117,1,117,16],[119,14,119,15]]}
[null,null,null,null,null,null,null,null,null,null,null,null,null,null,null,null,"Financing of Refundable SR&ED Tax Credits"]
[null,null,null,null,null,null,null,null,null,null,null,null,null,null,null,null,"Fiscal year ending after March 18, 2019"]
["LOAN / GUARANTEE APPLICATION"]
["General information"]
[null,{"$f":"I9","v":0}]
["1.0","Has the company read and understood the “Instructions” tab?"]
["1.1 ","IDENTIFICATION",null,null,null,null,null,null,null,null,null,null,null,null,null,null,null,null,"00:00:00"]
[]
[null,"Name of company submitting the application:"]
[null,"NEQ (Québec enterprise number):"]
[]
[null,"Address of head office:"]
[]
[]
[]
[null,"Address of the main office:"]
[null,"(If different from head office)"]
[]
[]
[null,"Contact person:"]
{"$rows_left_out":122}
{"sheet":"Year 1 - To fill","index":2,"n_rows":189,"n_cols":28,"rows_kept":189,"cut":false,"hidden":false,"merged":[[0,7,0,13],[8,2,8,7],[9,2,9,7],[0,1,0,5],[2,0,2,13],[3,0,3,13],[4,2,4,8],[133,18,133,20],[132,18,132,20],[31,11,32,11],[34,11,35,11],[55,2,55,8],[62,2,62,8],[51,2,51,8],[53,2,53,8],[56,2,56,8],[57,2,57,8],[52,2,52,8],[41,1,41,13],[77,1,78,13],[26,21,26,22],[17,2,17,9],[16,13,21,13],[131,18,131,20],[20,7,20,9],[21,3,21,9],[18,2,18,9],[22,9,24,13]]}
[null,null,null,null,null,null,null,"Financing of Refundable SR&ED Tax Credits"]
[null,null,null,null,null,null,null,null,null,null,null,null,null,"Fiscal year ending after March 18, 2019"]
["LOAN / GUARANTEE APPLICATION"]
["Calculations for tax credits to be financed (year 1)"]
[null,null,{"$f":"'General information - To fill'!I9","v":0},null,null,null,null,null,null,null,{"$f":"'General information - To fill'!I5","v":0},{"$f":"'General information - To fill'!L5","v":0},null,{"$f":"'General information - To fill'!M5","v":0}]
[null,null,null,null,null,null,null,null,null,null,{"$f":"IF(RNumeroConfirmationDemande<>\"\",\"Nº. Demande\",\"\")","v":""},{"$f":"ANumeroConfirmationDemande","v":0},null,{"$f":"IF(RDateTransmissionDemande<>\"\",\"transmis le\",\"\")","v":""},null,null,null,null,null,null,"Québec applicable rate -",null,null,null,null,null,null,"Yes"]
[null,"2.0 ELIGIBILITY FOR REFUNDABLE SR&ED TAX CREDITS",null,null,null,null,null,null,null,null,null,null,null,null,null,null,null,{"$f":"IF(AND(MONTH(DATE(YEAR(RCalculDateDebut1),2,29)) =2,MONTH(RCalculDateDebut1)<3),TRUE,FALSE)","v":true},null,null,"net eligible expenditures under $3,000,000 ",null,null,null,null,null,null,"No"]
[null,null,null,null,null,null,null,null,null,null,null,"(yyyy-mm-dd)",null,null,null,null,null,{"$f":"IF(AND(MONTH(DATE(YEAR(RCalculDateFin1),2,29)) =2,MONTH(RCalculDateFin1)>2),TRUE,FALSE)","v":false},null,null,"(based on assets as per financial statements including associated companies)"]
[null,null,"Fiscal year to be financed:",null,null,null,null,null,null,"Start date:",null,null,{"$f":"\"   Warning :\"","v":"   Warning :"},null,null,null,null,{"$f":"RCalculDateFin1-RCalculDateDebut1","v":0},{"$f":"IF(OR(R7=TRUE,R8=TRUE),365,364)","v":365},null,"Net eligible expenditures"]
[null,null," (ending after March 18, 2019)",null,null,null,null,null,null,null,null,null,null,null,null,null,null,null,null,null,"(example)"]
[null,null,null,null,null,null,null,null,null,"End date:",null,null,{"$f":"\"   doesn't represent 12 months\"","v":"   doesn't represent 12 months"},null,null,null,null,null,null,null,null,1,0.3]
[null,null,null,null,null,null,null,null,null,null,null,null,null,null,null,null,null,null,null,null,null,25000000,0.3]
[null,"2.1 ELIGIBILITY FOR REFUNDABLE SR&ED TAX CREDITS",null,null,null,null,null,null,null,null,null,null,null,null,null,null,null,null,null,null,null,50000000,0.3]
[null,null,null,null,null,null,null,null,null,null,null,null,null,null,null,null,null,null,null,null,null,55000000,0.26800000000000002]
[null,null,null,null,null,null,null,null,null,"The company submitting the application is a Canadian corporation ",null,null,null,null,null,null,null,3,null,null,null,60000000,0.23599999999999999]
[null,null,null,null,null,null,null,null,null,"(as defined by the QuébecTaxation Act)",null,null,null,null,null,null,null,null,null,null,null,65000000,0.20399999999999999]
[null,null,null,null,null,null,null,null,null,null,null,null,null,{"$f":"IF(RmontantEtatFinancierQuebec1<RmontantEtatFinancierQuebec1exc,\"Assets including associated companies must be greater or equal to the assets excluding associated compagnies\",\"\")","v":""},null,null,null,null,null,null,null,70000000,0.17199999999999999]
[null,null,"Assets as per financial statements (year preceding the fiscal year) excluding associated companies:",null,null,null,null,null,null,null,"$",null,null,null,null,null,null,null,null,null,null,75000000,0.14000000000000001]
[null,null,"Assets as per financial statements (year preceding the fiscal year) including associated companies:",null,null,null,null,null,null,null,"$",null,null,null,null,null,null,{"$f":"ROUND(0.375-((MAX(25000000,(MIN(50000000,L19)))-25000000)*0.2)/25000000,4)","v":0.17499999999999999},null,null,"* The rate for eligible expenditures exceeding the limit of $3,000,000 is 14%"]
[]
{"$rows_left_out":170}
{"sheet":"Year 2 - To fill","index":3,"n_rows":189,"n_cols":28,"rows_kept":189,"cut":false,"hidden":false,"merged":[[77,1,78,13],[22,9,24,13],[0,1,0,5],[0,7,0,13],[4,2,4,8],[2,0,2,13],[3,0,3,13],[8,2,8,7],[9,2,9,7],[18,2,18,9],[20,7,20,9],[21,3,21,9],[26,21,26,22],[17,2,17,9],[16,13,21,13],[132,18,132,20],[133,18,133,20],[56,2,56,8],[31,11,32,11],[34,11,35,11],[41,1,41,13],[51,2,51,8],[52,2,52,8],[55,2,55,8],[53,2,53,8],[57,2,57,8],[62,2,62,8],[131,18,131,20]]}
[null,null,null,null,null,null,null,"Financing of Refundable SR&ED Tax Credits"]
[null,null,null,null,null,null,null,null,null,null,null,null,null,"Fiscal year ending after March 18, 2019"]
["LOAN / GUARANTEE APPLICATION"]
["Calculations for tax credits to be financed (year 2)"]
[null,null,{"$f":"'General information - To fill'!I9","v":0},null,null,null,null,null,null,null,{"$f":"'General information - To fill'!I5","v":0},{"$f":"'General information - To fill'!L5","v":0},null,{"$f":"'General information - To fill'!M5","v":0}]
[null,null,null,null,null,null,null,null,null,null,{"$f":"IF(RNumeroConfirmationDemande<>\"\",\"Nº. Demande\",\"\")","v":""},{"$f":"ANumeroConfirmationDemande","v":0},null,{"$f":"IF(RDateTransmissionDemande<>\"\",\"transmis le\",\"\")","v":""},null,null,null,null,null,null,"Québec applicable rate -",null,null,null,null,null,null,"Yes"]
[null,"2.0 ELIGIBILITY FOR REFUNDABLE SR&ED TAX CREDITS",null,null,null,null,null,null,null,null,null,null,null,null,null,null,null,{"$f":"IF(AND(MONTH(DATE(YEAR(RCalculDateDebut1),2,29)) =2,MONTH(RCalculDateDebut1)<3),TRUE,FALSE)","v":true},null,null,"net eligible expenditures under $3,000,000 ",null,null,null,null,null,null,"No"]
[null,null,null,null,null,null,null,null,null,null,null,"(yyyy-mm-dd)",null,null,null,null,null,{"$f":"IF(AND(MONTH(DATE(YEAR(RCalculDateFin1),2,29)) =2,MONTH(RCalculDateFin1)>2),TRUE,FALSE)","v":false},null,null,"(based on assets as per financial statements including associated companies)"]
[null,null,"Fiscal year to be financed:",null,null,null,null,null,null,"Start date:",null,null,{"$f":"\"   Warning :\"","v":"   Warning :"},null,null,null,null,{"$f":"RCalculDateFin1-RCalculDateDebut1","v":0},{"$f":"IF(OR(R7=TRUE,R8=TRUE),365,364)","v":365},null,"Net eligible expenditures"]
[null,null," (ending after March 18, 2019)",null,null,null,null,null,null,null,null,null,null,null,null,null,null,null,null,null,"(example)"]
[null,null,null,null,null,null,null,null,null,"End date:",null,null,{"$f":"\"   does not represent 12 months\"","v":"   does not represent 12 months"},null,null,null,null,null,null,null,null,1,0.3]
[null,null,null,null,null,null,null,null,null,null,null,null,null,null,null,null,null,null,null,null,null,25000000,0.3]
[null,"2.1 ELIGIBILITY FOR REFUNDABLE SR&ED TAX CREDITS",null,null,null,null,null,null,null,null,null,null,null,null,null,null,null,null,null,null,null,50000000,0.3]
[null,null,null,null,null,null,null,null,null,null,null,null,null,null,null,null,null,null,null,null,null,55000000,0.26800000000000002]
[null,null,null,null,null,null,null,null,null,"The company submitting the application is a Canadian corporation ",null,null,null,null,null,null,null,3,null,null,null,60000000,0.23599999999999999]
[null,null,null,null,null,null,null,null,null,"(as defined by the Québec Taxation Act)",null,null,null,null,null,null,null,null,null,null,null,65000000,0.20399999999999999]
[null,null,null,null,null,null,null,null,null,null,null,null,null,{"$f":"IF(RmontantEtatFinancierQuebec1<RmontantEtatFinancierQuebec2exc,\"Assets including associated companies must be greater or equal to the assets excluding associated compagnies\",\"\")","v":""},null,null,null,null,null,null,null,70000000,0.17199999999999999]
[null,null,"Assets as per financial statements (year preceding the fiscal year) excluding associated companies:",null,null,null,null,null,null,null,"$",null,null,null,null,null,null,null,null,null,null,75000000,0.14000000000000001]
[null,null,"Assets as per financial statements (year preceding the fiscal year) including associated companies:",null,null,null,null,null,null,null,"$",null,null,null,null,null,null,{"$f":"ROUND(0.375-((MAX(25000000,(MIN(50000000,L19)))-25000000)*0.2)/25000000,4)","v":0.17499999999999999},null,null,"* The rate for eligible expenditures exceeding the limit of $3,000,000 is 14%"]
[]
{"$rows_left_out":170}
{"sheet":"Calculation Details","index":4,"n_rows":148,"n_cols":27,"rows_kept":148,"cut":false,"hidden":false,"merged":[[135,2,135,9],[125,2,125,10],[55,14,56,14],[121,2,121,10],[71,2,71,8],[73,2,73,7],[126,2,126,7],[80,2,80,8],[60,3,60,8],[55,3,55,8],[55,9,56,9],[55,11,56,11],[56,3,56,7],[91,3,91,8],[93,3,93,8],[95,3,95,8],[0,8,0,15],[36,14,37,14],[52,14,53,14],[11,11,11,12],[12,2,12,9],[13,11,13,12],[27,11,27,12],[29,11,29,12],[36,11,37,11],[49,3,49,8],[59,3,59,8],[52,3,52,8],[52,11,53,11],[57,3,57,8],[6,2,6,9],[53,3,53,7],[58,3,58,8]]}
[" ",null,null,null,null,null,null,null,"Financing of Refundable SR&ED Tax Credits"]
[null,null,null,null,null,null,null,null,null,null,null,null,null,null,null,"Fiscal year ending after March 18, 2019"]
[null,null,null,null,null,null,null,null,"LOAN / GUARANTEE APPLICATION"]
[null,null,"For use by Investissement Québec",null,null,null,null,null,"Calculations of SR&ED tax credits "]
[]
[null,null,"Québec - Applicable rates for the calculation of SR&ED tax credits "]
[null,null,"Applicable rate for calculating SR&ED tax credits on eligible expenditures (Québec):"]
[null,null,null,null,null,null,null,null,null,"Start date:",null,{"$f":"RCalculDateDebut1","v":"00:00:00"},null,null,{"$f":"'Year 2 - To fill'!RCalculDateDebut1","v":"00:00:00"}]
[null,null,null,null,null,null,null,null,null,"End date:",null,{"$f":"RCalculDateFin1","v":"00:00:00"},null,null,{"$f":"'Year 2 - To fill'!RCalculDateFin1","v":"00:00:00"}]
[]
[null,null,null,null,null,null,null,null,null,"Exclusion threshold amount:",null,{"$f":"'Year 1 - To fill'!R34","v":50000},null,null,{"$f":"'Year 2 - To fill'!R34","v":50000}]
[]
[null,null,"Applicable rate for eligible expenditures not exceeding the expenditure limit of $3,000,000",null,null,null,null,null,null,null,null,{"$f":"IF('Year 1 - To fill'!R15=2,0.175,IF(OR('Year 1 - To fill'!L19=\"\",'Year 1 - To fill'!L19=0),0,IF(AND('Year 1 - To fill'!L19>0,'Year 1 - To fill'!R30>0,'Year 1 - To fill'!S80),'Year 1 - To fill'!R30,0)))","v":0},null,null,{"$f":"IF('Year 2 - To fill'!R15=2,0.175,IF(OR('Year 2 - To fill'!L19=\"\",'Year 2 - To fill'!L19=0),0,IF(AND('Year 2 - To fill'!L19>0,'Year 2 - To fill'!R30>0,'Year 2 - To fill'!S80),'Year 2 - To fill'!R30,0)))","v":0}]
[]
[null,null,null,null,null,null,null,null,null,"Applicable rate for eligible expenditures exceeding the expenditure limit of $3,000,000",null,0.14000000000000001,null,null,0.14000000000000001]
[]
[]
[null,null,"Federal - Calculation of expenditure limit  for  enhanced refundable SR&ED tax credits: "]
[]
[]
{"$rows_left_out":129}
{"sheet":"Title","index":5,"n_rows":7,"n_cols":1,"rows_kept":7,"cut":false,"hidden":true,"merged":[]}
[]
["President"]
["Vice-president of finance"]
["Vice-president of R&D"]
["Controller"]
["Shareholder"]
["Other (specify)"]